{"text_format":"1","workbook":"xlsx","n_sheets":15,"sheets":["About JEDI","Start","FAQ","ProjectData","SummaryResults","User Add-in Location","DefaultData","Calculations","Deflators","Household Exp","Multipliers","Line Config Data","Transformer Data","Terrain and Pop Multipliers","Wage Data"],"not_rendered":{"charts":0,"images":0,"macros":1,"external_links":0,"defined_names":32,"comments":4,"pivot_tables":0},"unopened":[],"bounds":{"document_bytes":16777216,"sheet_cells":100000,"rows_first":2000,"rows_last":500,"rows_between":2000,"halvings":0,"cell_chars":16384,"cell_head_chars":4096},"cells_cut":0,"cells_raw":0,"read":"whole","date_system":"1900"}

{"sheet":"About JEDI","index":0,"n_rows":44,"n_cols":2,"rows_kept":44,"cut":false,"hidden":false,"merged":[]}
[]
[]
[null,"JEDI - TRANSMISSION LINE"]
[]
[null,"Jobs and Economic Development Impact Model (JEDI)"]
[]
{"$rows_left_out":39}
{"sheet":"Start","index":1,"n_rows":4,"n_cols":30,"rows_kept":4,"cut":false,"hidden":false,"merged":[]}
[]
[null,null,null,null,null,null,null,null,null,null,null,null,null,null,null,null,null,null,null,null,null,null,null,null,null,null,null,null,null,"  "]
["JEDI - TRANSMISSION LINE"]
["Jobs and Economic Development Impact Model"]

{"sheet":"FAQ","index":2,"n_rows":57,"n_cols":2,"rows_kept":57,"cut":false,"hidden":false,"merged":[]}
[]
[null,"JEDI - TRANSMISSION"]
[]
[null,"Jobs and Economic Development Model (JEDI)"]
[]
[null,"Frequently Asked Questions (FAQ)"]
{"$rows_left_out":52}
{"sheet":"ProjectData","index":3,"n_rows":880,"n_cols":31,"rows_kept":880,"cut":false,"hidden":false,"merged":[[51,25,51,31],[51,1,51,7],[51,8,51,10],[3,0,3,7],[10,0,11,7],[4,0,4,7],[26,0,26,5],[5,0,5,6],[8,0,8,6]]}
["Transmission Line Project Data"]
["Please read instructions before getting started"]
[]
["INSTRUCTIONS:   "]
["1. Begin by entering Project Location (from pull-down list) and other Project Descriptive Data relevant to your particular project.  After inputting Descriptive Data press enter (or cursor to the next cell) to continue."]
["2. Once initial Project parameters are entered (lines 16-22), you may choose to perform a \"Simple\" analysis or an \"Advanced\" analysis."]
{"$rows_left_out":875}
{"sheet":"SummaryResults","index":4,"n_rows":152,"n_cols":63,"rows_kept":152,"cut":false,"hidden":false,"merged":[]}
[{"$f":"CONCATENATE(\"Transmission Line - Project Data Summary based on \",$AE$45, \" values\")","v":"Transmission Line - Project Data Summary based on User modifications to default values"},null,null,null,null,null,null,null,null,null,null,null,null,null,null,null,null,null,null,null,null,null,null,null,null,null,null,null,null,null,null,null,null,null,null,null,null,null,null,null,null,null,null,null,null,null,null,null,null,null,null,null,null,{"$f":"Summary_Results","v":"Transmission Line - Project Data Summary based on User modifications to default values"},null,null,null,null,null,"Project Descriptive Data"]
["Project Location",null,{"$f":"IF(ProjectData!B16=\"MyCounty\",'User Add-in Location'!B3,IF(ProjectData!B16=\"MyRegion\",'User Add-in Location'!B4,ProjectData!B16))","v":"Texas"},null,null,null,null,null,null,null,null,null,null,null,null,null,null,null,null,null,null,null,null,null,null,null,null,null,null,null,null,null,null,null,null,null,null,null,null,null,null,null,null,null,null,null,null,null,null,null,null,null,null,{"$f":"A2","v":"Project Location"},null,{"$f":"C2","v":"Texas"},null,null,null,{"$f":"ProjectData!A16","v":"  Project Location"},{"$f":"ProjectData!B16","v":"Texas"},null,{"$f":"IF(BI2=\"MYREGION\",IF('User Add-in Location'!BL13=0,\"Error - No Regional multiplier data in User Add-in Location\",\"\"),IF(BI2=\"MYCOUNTY\",IF('User Add-in Location'!BK13=0,\"Error - No County multiplier data in User Add-in Location\",\"\"),\"\"))","v":""}]
["Year of Construction or Installation",null,{"$f":"ProjectData!B18","v":2014},null,null,null,null,null,null,null,null,null,null,null,null,null,null,null,null,null,null,null,null,null,null,null,null,null,null,null,null,null,null,null,null,null,null,null,null,null,null,null,null,null,null,null,null,null,null,null,null,null,null,{"$f":"A3","v":"Year of Construction or Installation"},null,2014,null,null,null,{"$f":"ProjectData!A17","v":"  Population (only required for County/Region analysis)"},{"$f":"ProjectData!B17","v":0},null,{"$f":"IF(BI2=\"MYREGION\",IF('User Add-in Location'!BL13=0,\"\",IF(BI2=\"MYREGION\",\"Enter Region Population\",\"\")),IF(BI2=\"MYCOUNTY\",IF('User Add-in Location'!BK13=0,\"\",IF(BI2=\"MYCOUNTY\",\"Enter County Population\",\"\")),\"\"))","v":""}]
["Transmission Line Type",null,{"$f":"ProjectData!B19","v":"230 kV AC"},null,null,null,null,null,null,null,null,null,null,null,null,null,null,null,null,null,null,null,null,null,null,null,null,null,null,null,null,null,null,null,null,null,null,null,null,null,null,null,null,null,null,null,null,null,null,null,null,null,null,{"$f":"A4","v":"Transmission Line Type"},null,{"$f":"C4","v":"230 kV AC"},null,null,null,{"$f":"ProjectData!A18","v":"  Year of Construction/Installation"},{"$f":"ProjectData!B18","v":2014}]
["Transmission Line Length (Miles)",null,{"$f":"ProjectData!B20","v":20},{"$f":"ProjectData!C16","v":""},null,null,null,null,null,null,null,null,null,null,null,null,null,null,null,null,null,null,null,null,null,null,null,null,null,null,null,null,null,null,null,null,null,null,null,null,null,null,null,null,null,null,null,null,null,null,null,null,null,"Transmission Line Length (Miles)",null,20,null,null,null,{"$f":"ProjectData!A19","v":"  Transmission Line Type"},{"$f":"ProjectData!B19","v":"230 kV AC"}]
["Terrain Classification",null,{"$f":"ProjectData!B21","v":"Flat w/access"},null,null,null,null,null,null,null,null,null,null,null,null,null,null,null,null,null,null,null,null,null,null,null,null,null,null,null,null,null,null,null,null,null,null,null,null,null,null,null,null,null,null,null,null,null,null,null,null,null,null,"Terrain Classification",null,"Flat w/access",null,null,null,{"$f":"ProjectData!A20","v":"  Transmission Line Length (Miles)"},{"$f":"ProjectData!B20","v":20}]
{"$rows_left_out":147}
{"sheet":"User Add-in Location","index":5,"n_rows":210,"n_cols":6,"rows_kept":210,"cut":false,"hidden":false,"merged":[]}
[" Multipliers For Economic Input-Output Analysis"]
[]
["MyCounty (name)",null,"Year of Data",null,{"$f":"IF(B3=\"\",\"\",IF(D3=\"\",\"Enter Year of Data\",IF(D3>2006,IF(D3<2016,\"\",\"ERROR - Deflators Data Not Current\"),\"ERROR - Deflators Data Not Current\")))","v":""}]
["MyRegion (includes)",null,"Year of Data",null,{"$f":"IF(B4=\"\",\"\",IF(D4=\"\",\"Enter Year of Data\",IF(D4>2006,IF(D4<2016,\"\",\"ERROR - Deflators Data Not Current\"),\"ERROR - Deflators Data Not Current\")))","v":""}]
["Sales Tax Rate (%)",null,{"$f":"IF(B$5=\"\",\"     To incorporate Sales Tax in analysis Enter Sales Tax Rate\",\"\")","v":"     To incorporate Sales Tax in analysis Enter Sales Tax Rate"}]
["Property Tax Exemption (%)",null,{"$f":"IF(B$6=\"\",\"     To incorporate Property Tax Exemption (if applicable) in analysis Enter Percentage\",\"\")","v":"     To incorporate Property Tax Exemption (if applicable) in analysis Enter Percentage"}]
{"$rows_left_out":205}
{"sheet":"DefaultData","index":6,"n_rows":122,"n_cols":88,"rows_kept":122,"cut":false,"hidden":false,"merged":[]}
[null,null,"System Type"]
[null,null,{"$f":"ProjectData!B19","v":"230 kV AC"}]
[null,null,null,null,null,null,null,null,null,null,null,null,null,null,null,null,null,null,null,null,null,null,null,null,null,null,null,null,null,null,null,null,null,null,"Multiplier"]
[null,null,"Number of Substations Installed","Miles of Line","Number of Converter Stations",null,null,null,null,null,null,null,null,null,null,null,null,null,null,null,null,null,null,null,null,null,null,null,null,null,null,null,"Terrain",{"$f":"ProjectData!B21","v":"Flat w/access"},{"$f":"VLOOKUP($AH4,'Terrain and Pop Multipliers'!B9:C13,2)","v":1}]
["Warning",null,{"$f":"ProjectData!B36","v":1},{"$f":"ProjectData!B20","v":20},{"$f":"IF(ProjectData!B19=\"500 kV HVDC\",2,0)","v":0},null,null,null,null,null,null,null,null,null,null,null,null,null,null,null,null,null,null,null,null,null,null,null,null,null,null,null,"Pop. Density",{"$f":"ProjectData!B22","v":"Rural"},{"$f":"VLOOKUP($AH5,'Terrain and Pop Multipliers'!B18:D20,2)","v":1}]
[null,null,null,null,null,null,null,null,null,null,null,null,null,null,null,null,null,null,null,null,null,null,null,null,null,null,null,null,null,null,null,null,"Line length",{"$f":"ProjectData!B20","v":20},{"$f":"'Terrain and Pop Multipliers'!C25","v":1}]
{"$rows_left_out":117}
{"sheet":"Calculations","index":7,"n_rows":298,"n_cols":37,"rows_kept":298,"cut":false,"hidden":false,"merged":[]}
[null,null,"Economic Impact Analysis for ",null,{"$f":"ProjectData!B16","v":"Texas"},{"$f":"Project_Data","v":"Transmission Line Project Data"}]
[]
[null,null,null,null,null,null,null,null,"Manufactured",null,null,null,null,null,null,null,null,null,null,null,null,null,null,null,null,null,null,"Detailed PV Project Data Costs",{"$f":"IF(ProjectData!B$16=\"MyCounty\",'User Add-in Location'!B$3,IF(ProjectData!B$16=\"MyRegion\",'User Add-in Location'!B4,ProjectData!B$16))","v":"Texas"},{"$f":"ProjectData!_xlnm.Print_Area","v":2014}]
[null,null,"Project Construction Costs "]
["Warning",null,{"$f":"DefaultData!B13","v":"Transmission Line Costs"},"Cost","Local Share",null,"Local $ Spending",null,null,null,null,null,null,null,null,null,null,null,null,null,null,null,null,null,null,null,null,{"$f":"C5","v":"Transmission Line Costs"},"Cost","Local Share"]
[null,null,{"$f":"DefaultData!B14","v":"  Development and Preconstruction Activites"},null,null,null,null,null,null,null,null,null,null,null,null,null,null,null,null,null,null,null,null,null,null,null,null,"  Development and Preconstruction Activites"]
{"$rows_left_out":293}
{"sheet":"Deflators","index":8,"n_rows":55,"n_cols":39,"rows_kept":55,"cut":false,"hidden":false,"merged":[]}
[]
[null,null,{"$f":"CONCATENATE(\"Conversion to Year \",E4,\" dollars and back for consistency with multiplier data.\")","v":"Conversion to Year 2014 dollars and back for consistency with multiplier data."}]
[]
[null,null,"  Year of Multiplier Data",null,{"$f":"IF(ProjectData!B16=\"MYCOUNTY\",'User Add-in Location'!D3,IF(ProjectData!B16=\"MYREGION\",'User Add-in Location'!D4,Multipliers!D2))","v":2014},{"$f":"IF(E4=0,\"ERROR\",\"\")","v":""},"Region of Analysis",null,{"$f":"ProjectData!B16","v":"Texas"}]
["Warning",null,"  Year of Construction $s",null,{"$f":"+ProjectData!B50","v":2012}]
[]
{"$rows_left_out":50}
{"sheet":"Household Exp","index":9,"n_rows":20,"n_cols":57,"rows_kept":20,"cut":false,"hidden":true,"merged":[]}
[null,null,"Personal Consumption Expenditures "]
[null,null,"Year of Data",2014]
[null,null,null,"Alabama","Alaska","Arizona","Arkansas","California","Colorado","Connecticut","Delaware","District of Columbia","Florida","Georgia","Hawaii","Idaho","Illinois","Indiana","Iowa","Kansas","Kentucky","Louisiana","Maine","Maryland","Massachusetts","Michigan","Minnesota","Mississippi","Missouri","Montana",{"$f":"'User Add-in Location'!E9","v":"MyCounty"},{"$f":"'User Add-in Location'!F9","v":"MyRegion"},"Nebraska","Nevada","New Hampshire","New Jersey","New Mexico","New York","North Carolina","North Dakota","Ohio","Oklahoma","Oregon","Pennsylvania","Rhode Island","South Carolina","South Dakota","Tennessee","Texas","United States","Utah","Vermont","Virginia","Washington","West Virginia","Wisconsin","Wyoming"]
[null,null,"Agriculture",4.3843303811985359E-3,1.4119513424010147E-3,4.5642380753062282E-3,8.1786328792903557E-3,3.9792492388490055E-3,7.0195462872580253E-3,7.6086075854367723E-4,5.1514563718655336E-3,4.2922894157143207E-4,3.4583683647851009E-3,4.5081025455065496E-3,4.9429891793557282E-3,9.4917506916313097E-3,2.8667610141038728E-3,2.5450437181696911E-3,9.3934737604823137E-3,8.7900656478127337E-3,3.1759610937596942E-3,1.6396370820067549E-3,4.0676609250438669E-3,2.0831860584223857E-3,6.3727734320123469E-4,2.3812381206889124E-3,5.6398054812691872E-3,6.3861398447143574E-3,4.1043641887382794E-3,6.2438382649901989E-3,{"$f":"'User Add-in Location'!E10","v":0},1,8.8871317877506888E-3,2.5375642195257738E-3,1.3888574975611571E-3,5.5163955170102247E-4,6.9791702369014427E-3,2.8803446526979911E-3,4.6077941083095941E-3,5.6095972719861992E-3,2.0636412707860049E-3,4.9050588826224902E-3,6.3409776607044714E-3,2.9035521794555925E-3,5.1679885725791034E-4,2.462276782699504E-3,9.4962445436134052E-3,2.0966127647710255E-3,3.014855508898549E-3,5.5260114358864042E-3,3.326996211047858E-3,8.7538136649898297E-3,3.7363843893953568E-3,3.8505743532937222E-3,2.7076340157701534E-3,7.5054452682812509E-3,3.9891255794072527E-3]
["Warning",null,"Mining",3.6773337946463026E-6,2.3634816624978557E-5,4.4283297127019233E-6,6.797702789397975E-6,7.6359916951794383E-6,1.2855165380975011E-5,1.4421870222460384E-6,6.185274109112409E-7,4.0821663890116674E-7,3.6201289907853514E-6,1.558401713256141E-6,2.0201369292087284E-6,3.6726986121286635E-6,2.3025902350079342E-6,2.008952670351302E-6,1.2867504950935838E-6,1.1185176603211212E-5,3.426991232403623E-6,2.1146912621011047E-5,1.2332214245915419E-6,1.9918351578770608E-6,1.2748979158907943E-6,2.4440630223929237E-6,1.4453697351436066E-6,6.8153249216265298E-6,1.6836757825805849E-6,1.1670530787507312E-5,{"$f":"'User Add-in Location'!E11","v":0},{"$f":"'User Add-in Location'!F11","v":0},2.0100264979982797E-6,1.1249469601524793E-5,1.717982414294884E-6,1.2543190654021425E-6,2.3480613968216137E-5,1.6327890029108609E-6,1.4217484079774229E-6,1.7772514413667098E-5,4.4978991890939157E-6,2.06275835213656E-5,2.1103497251827175E-6,7.6035986913116547E-6,9.4759943939609369E-7,1.2506144101517982E-6,3.3045540792100384E-6,1.6208048456688673E-6,2.145813723175278E-5,1.1925970050436198E-5,1.0051868482481531E-5,2.1244916594583427E-6,3.0913345668405351E-6,1.6061511540393748E-6,1.3350154124952537E-5,1.1620933271415177E-6,2.7073449336075241E-5]
[null,null,"Construction",0,0,0,0,0,0,0,0,0,0,0,0,0,0,0,0,0,0,0,0,0,0,0,0,0,0,0,{"$f":"'User Add-in Location'!E12","v":0},{"$f":"'User Add-in Location'!F12","v":0},0,0,0,0,0,0,0,0,0,0,0,0,0,0,0,0,0,0,0,0,0,0,0,0,0]
{"$rows_left_out":15}
{"sheet":"Multipliers","index":10,"n_rows":226,"n_cols":57,"rows_kept":226,"cut":false,"hidden":true,"merged":[[206,2,206,7]]}
[null,null," Multipliers For Economic Input-Output Analysis"]
[null,null,"Year of Data",2014]
[null,null,"Jobs Per Million Dollars Change in Final Demand"]
[null,null,"  Jobs Direct Multipliers","Alabama","Alaska","Arizona","Arkansas","California","Colorado","Connecticut","Delaware","District of Columbia","Florida","Georgia","Hawaii","Idaho","Illinois","Indiana","Iowa","Kansas","Kentucky","Louisiana","Maine","Maryland","Massachusetts","Michigan","Minnesota","Mississippi","Missouri","Montana","MyCounty","MyRegion","Nebraska","Nevada","New Hampshire","New Jersey","New Mexico","New York","North Carolina","North Dakota","Ohio","Oklahoma","Oregon","Pennsylvania","Rhode Island","South Carolina","South Dakota","Tennessee","Texas","United States","Utah","Vermont","Virginia","Washington","West Virginia","Wisconsin","Wyoming"]
["Warning",null,"Agriculture",6.5663015045558328,15.007987862510836,7.0846371347429953,4.826203119125676,6.4064739508622397,5.3327562463783602,10.92911050768118,2.1427253941237847,32.548691043673088,9.8466682201793301,5.3003107956201037,15.700155296893501,4.3942043294119415,3.9758007039236603,4.9259886709375857,2.8565842192292377,3.3648775995019649,11.000360246278921,8.0091573924269834,12.25358869064806,6.7707329622302233,14.203249702918191,7.4627809434201628,4.1832733089772223,5.943993733603512,8.0674112781942782,5.8716795525144336,{"$f":"'User Add-in Location'!B10","v":0},{"$f":"'User Add-in Location'!C10","v":0},1.9400922797206936,5.0584565344618202,14.270528031944099,14.399031849449479,7.2012529050545702,7.8477384931179763,4.6722488171031573,3.6774966274772511,7.3894743190244023,9.5558103321369678,10.973628912630197,7.9622842868706858,12.478159874798642,8.8901394158803395,2.8738458192074252,14.213445769272573,9.068770211184944,6.1851950930645732,6.9827820154584952,8.7575038269827594,10.059155813895963,8.5532339583875689,18.067995755372415,6.0720271018909671,6.0865226650108992]
[null,null,"Mining",2.1217253173606982,1.1545064345650051,2.2579208180524302,3.3815852731898213,1.9009331827578337,2.4706544185030288,4.560099781423375,4.3441267428190811,5.4270365894704629,3.8621602818585825,4.1706590237824814,5.1325576339942822,3.9741334224092788,2.9996732076009116,2.5167932095734971,4.7575558372165849,4.8576760222946387,2.209793768067291,2.3092231612274614,7.2698137863822607,3.0838668795599453,3.9605628856714223,4.1434676681739697,2.3585410048996196,3.5617445102636367,3.0183302285014721,2.7152476241623149,{"$f":"'User Add-in Location'!B11","v":0},{"$f":"'User Add-in Location'!C11","v":0},4.3627959818079853,2.3153345550315967,5.0670945264291074,3.7325409322545151,2.5869083542754687,5.2739166867905771,3.4134655551633974,2.5400940438975459,3.1204572345899502,3.0839265602222388,5.2888486005257871,2.282537681469019,5.2339062068773359,4.8477577541185468,4.9183961619501533,3.4888015829998515,1.8761954307556152,2.3006834223650503,2.6863234146781592,4.4074662526448574,2.4715547976286518,4.3192093614218896,2.0904075373773989,3.808428888735564,1.6924850767937261]
{"$rows_left_out":221}
{"sheet":"Line Config Data","index":11,"n_rows":45,"n_cols":12,"rows_kept":45,"cut":false,"hidden":false,"merged":[]}
[null,"Transmission Line Standard Configuration Assumptions"]
[null,null,null,null,null,"AC","AC","AC","AC","HVDC Bipole","AC","AC"]
[null,1,null,"Unit",{"$f":"ProjectData!B19","v":"230 kV AC"},"115 kV AC","230 kV AC","345 kV AC","500 kV AC","500 kV HVDC","69 kV AC","765 kV AC"]
[null,{"$f":"B3+1","v":2}]
["Warning",{"$f":"B4+1","v":3}]
[null,4,"Structure Configuration",null,null,"Steel Pole","Steel Pole","Steel Pole","Lattice Tower","Lattice Tower","Steel Pole","Lattice Tower"]
{"$rows_left_out":40}
{"sheet":"Transformer Data","index":12,"n_rows":46,"n_cols":19,"rows_kept":46,"cut":false,"hidden":false,"merged":[]}
[null,"Transformer Data",null,null,null,null,null,null,null,null,null,{"$f":"DefaultData!E9","v":230},"Line Voltage"]
[null,null,null,null,null,null,null,null,null,null,null,{"$f":"IF(ProjectData!B24=\"Advanced\",ProjectData!B39,ProjectData!Z39)","v":115},"Grid Voltage"]
[null,"Line","Grid","MW","MVA","Transformer","Cost","# Grid-Side","Grid-Side","Total"]
[null,"Voltage","Voltage","Capacity","Capacity","Cost","per MVA","Positions*","Sub Cost**","Cost",null,null,"Transformer","# Grid-Side","Grid-Side"]
["Warning",null,null,null,null,null,null,null,null,null,null,null,"Cost","Positions*","Sub Cost**"]
[null,69,115,75,83,1000000,12000,1,800000,1800000,null,69,{"$f":"IF($L1=$L6,VLOOKUP($L2,$C$6:$I$10,4),\"\")","v":""},{"$f":"IF($L1=$L6,VLOOKUP($L2,$C$6:$I$10,6),\"\")","v":""},{"$f":"IF($L1=$L6,VLOOKUP($L2,$C$6:$I$10,7),\"\")","v":""}]
{"$rows_left_out":41}
{"sheet":"Terrain and Pop Multipliers","index":13,"n_rows":25,"n_cols":6,"rows_kept":25,"cut":false,"hidden":false,"merged":[]}
[null,"Terrain and Population Density Multipliers"]
[]
[]
[null,null,"Procurement &","Private"]
["Warning",null,"Construction (PC)","Right-of-Way"]
[null,null,"Cost Multiplier","Cost Multiplier"]
{"$rows_left_out":20}
{"sheet":"Wage Data","index":14,"n_rows":36,"n_cols":57,"rows_kept":36,"cut":false,"hidden":false,"merged":[]}
[null,null,null,"Hourly Mean Wage Data"]
[]
[null,null,null,"Occupation: Electrical Power-Line Installers and Repairers (SOC code 499051), May 2012"]
[null,null,1,"Alabama","Alaska","Arizona","Arkansas","California","Colorado","Connecticut","Delaware","District of Columbia","Florida","Georgia","Hawaii","Idaho","Illinois","Indiana","Iowa","Kansas","Kentucky","Louisiana","Maine","Maryland","Massachusetts","Michigan","Minnesota","Mississippi","Missouri","Montana","MyCounty","MyRegion","Nebraska","Nevada","New Hampshire","New Jersey","New Mexico","New York","North Carolina","North Dakota","Ohio","Oklahoma","Oregon","Pennsylvania","Rhode Island","South Carolina","South Dakota","Tennessee","Texas","United States","Utah","Vermont","Virginia","Washington","West Virginia","Wisconsin","Wyoming"]
["Warning",null,{"$f":"C4+1","v":2},28.84,35.28,32.75,25.95,42.25,31.81,34.869999999999997,35.04,30.19,25.57,22.98,36.19,34.79,35.01,30.49,27.47,28.2,26.51,24.24,25.42,27.94,35.82,30.27,29.29,25.46,30.84,35.1,{"$f":"AX5","v":29.94},{"$f":"AX5","v":29.94},27.28,33.86,31.76,37.44,26.39,36.18,25.25,28.42,26.88,23.65,37.32,29.65,35.380000000000003,24.89,28.42,28.13,25.27,29.94,29.85,30.5,25.57,38.299999999999997,26.14,33.15,34.630000000000003]
[null,null,{"$f":"C5+1","v":3},"Percent of US"]
{"$rows_left_out":30}