{"text_format":"1","workbook":"xlsx","n_sheets":11,"sheets":["About JEDI","FAQ","Start","ProjectData","SummaryResults","User Add-in Location","DefaultData","Calculations","Deflators","Household Exp","Multipliers"],"not_rendered":{"charts":0,"images":4,"macros":1,"external_links":0,"defined_names":19,"comments":5,"pivot_tables":0},"unopened":[],"bounds":{"document_bytes":16777216,"sheet_cells":100000,"rows_first":2000,"rows_last":500,"rows_between":2000,"halvings":0,"cell_chars":16384,"cell_head_chars":4096},"cells_cut":0,"cells_raw":0,"read":"whole","date_system":"1900"}

{"sheet":"About JEDI","index":0,"n_rows":54,"n_cols":2,"rows_kept":54,"cut":false,"hidden":false,"merged":[]}
[]
[]
[null,"JEDI - Marine and Hydrokinetic"]
[]
[null,"Jobs and Economic Development Model (JEDI)"]
[]
[]
[]
[null,"Release Number: MH12.23.16"]
[]
[]
[null,"     The Jobs and Economic Development Impact Model (JEDI) for Marine and Hydrokinetic was developed to demonstrate the economic benefits associated with"]
[null,"marine hydro systems in the United States.  The primary goal in developing the state level model was to provide a tool for system developers, renewable energy  "]
[null,"advocates, government officials, decision makers and other potential users, to easily identify the local economic impacts associated with constructing and operating "]
[null,"these systems. The second goal was to facilitate broad access and usage of the model by making it adaptable to a web based application that can be put on  "]
[null,"a web site. "]
[null,"     Consistent with these goals, a strong emphasis was placed on designing the model in a user-friendly format that could be easily modified - reflecting different "]
[null," levels of project specific information and user skill. This insures the greatest flexibility for inexperienced spreadsheet users, those unfamiliar with economic impact "]
[null,"analysis and more experienced and knowledgeable users who have a need for this specific type of analysis. "]
[null,"     Persons wishing more information on how and/or where the model is being used or the role of the National Renewable Energy Laboratory in analyzing "]
[null,"hydro and other renewable technologies should contact Suzanne Tegen at:"]
[]
[null,"National Renewable Energy Laboratory"]
[null,"15013 Denver West Parkway"]
[null,"                                                                                                  Golden, Colorado, 80401"]
[null,"                                                                                                  Tel.: 303.384.6939"]
[null,"                                                                                                  Email: suzanne.tegen@nrel.gov."]
[]
[null,"     The model was developed by Marshall Goldberg of MRG & Associates, under contract with the National Renewable Energy Laboratory.  Persons wishing "]
[null,"more information on the methodology or data in the model should contact him at: "]
[]
[null,"MRG & Associates"]
[null,"17935 Starduster Dr."]
[null,"Nevada City, California, 95959"]
[null,"Tel.: 530.432.9373"]
[null,"Email: MRGAssociates@earthlink.net"]
[]
[null,"     Preliminary cost input data was developed by RE Vision Consulting, under contract with the U.S. Department of Energy.  Persons wanting more"]
[null,"information on the input data and technology assumptions should contact Mirko Previsic at: "]
[]
[null,"RE Vision Consulting, LLC"]
[null,"Sacramento, CA"]
[null,"Tel: 916-977 3970"]
[null,"Email: mirko@re-vision.net"]
[]
[]
[null,"     The JEDI model utilizes multipliers derived from IMPLAN data using the IMPLAN ProfessionalTM Version 3.0 Social Accounting & Impact Analysis "]
[null,"Software.  Persons wishing more information on the IMPLAN data or the software should contact the IMPLAN Group."]
[]
[null," IMPLAN Group, LLC"]
[null,"16740 Birkdale Commons Parkway Suite 206"]
[null,"Huntersville, North Carolina 28078"]
[null,"Tel: 651.439.4421"]
[null,"www.implan.com"]

{"sheet":"FAQ","index":1,"n_rows":59,"n_cols":2,"rows_kept":59,"cut":false,"hidden":false,"merged":[]}
[]
[null,"JEDI - Marine and Hydrokinetic"]
[]
[null,"Jobs and Economic Development Model (JEDI)"]
[]
[null,"Frequently Asked Questions (FAQ)"]
[]
[]
[null,"How can I determine which version of the JEDI model I have?"]
[null,"The version (release number) of the model you are currently using is listed in the \"About JEDI\" worksheet contained in this model.  "]
[]
[]
[null,"When I open up the model I receive a security alert message stating \"the macros in the file have been disabled,\" how do I change the security setting so I "]
[null,"can run the model with the macros enabled?  "]
[null,"The message you are receiving is related to the level of security you have chosen in your Excel™ set up.  To change the setting for opening files, open Excel™, on the "]
[null,"top toolbar, click on \"tools,\" then \"macros\" then \"security.\"  Reset the security level to \"medium,\" this will enable you to choose to enable or disable macros each"]
[null,"time you open a file.  Alternately, the model can be successfully run with the macros disabled."]
[]
[null,"How do I run a county or regional level analysis?"]
[null,"Running a county or regional level analysis is similar to running a state level analysis, although there are two key differences users must keep in mind.  First, the model "]
[null,"does not contain county or regional level multipliers, thus users must obtain these and add them into the model. (See FAQ on obtaining county or regional level"]
[null,"multipliers and how to add in the data)  Second, to run a county or regional level analysis users must enter the county or regional population in the Project Description"]
[null,"area.  The population provides a reference for the model to automatically insert 'local share\" defaults for the analysis."]
[]
[null,"Where can I get county or regional level data to add-in to the model to run a county or region specific analysis?"]
[null,"County level multipliers and personal consumption expenditure patterns are available from a number of sources.  Users familiar with IMPLAN or input-output modeling can "]
[null,"purchase the raw county level data and derive the multipliers themselves, purchase them from someone familiar with input-output modeling, purchase them directly from"]
[null," IMPLAN (www.implan.com), or contact MRG & Associates (mrgassociates@earthlink.net), the model developer."]
[]
[null,"How do I add in county or regional level multipliers and the personal consumption expenditure data?"]
[null,"Adding-in county or regional level multipliers and personal consumtption expenditure data involves going to the \"User Add-in Location\" worksheet in this model and "]
[null,"cutting and pasting the data into their respective locations.  With the data installed it is also necessary to insert the county or region name and the year of the data."]
[]
[null,"What does the \"local share\" refer to?"]
[null,"The \"local share\" refers to the percentage of each expenditure that is actually spent locally (i.e., in the state, county or region being analyzed).  For example, if $1 million"]
[null,"is going to be spent on construction materials and half ($500,000) of this total will be purchased from local suppliers, we say the \"local share\" is 50 percent."]
[]
[null,"I want to make my analysis as accurate as possible, where can I get information to adjust the default \"local share\" values (in the ProjectData worksheet) "]
[null,"for my state or county?"]
[null,"Since the \"local share\" is directly related to the availability of local businesses and services and their ability to meet the construction and annual operating demands"]
[null,"of the project, it is important to have an accurate picture of these local resources.  This can be obtained in a number of ways: contacting experienced and knowlegeable "]
[null,"persons in the area, contacting local business and contractor organizations and/or the local chamber of commerce, among others."]
[]
[null,"I want to make my property tax estimates as accurate as possible, where can I get information to modify the tax rates in the ProjectData worksheet. "]
[null,"for my state or county?"]
[null,"Calculating annual property taxes is different in every state and typically a complex formula.  The default methodology used in the model incorporates a generic formula"]
[null," that derives the taxes from the product of the assessed value (percentage of construction cost), the taxable value (percentage of assessed value) and the tax rate "]
[null,"(percentage of taxable value).  Alternately, users may input a know tax payment.  Information on tax rates and formulas for calculating property taxes can often be found"]
[null,"by contacting the state Dept. of Revenue or Taxation, or the local taxation authority."]
[]
[null,"I am interested in viewing and possibly editting internal formulas within the model, how do I access them?  "]
[null,"The JEDI model contains several intermediate worksheets that are an integral part of the model analysis. These worksheets are not designed to be changed by users."]
[null,"Several of these worksheets, including default data, calculations, and deflators may be viewed by merely clicking on the respective worksheet and scrolling to the right."]
[null,"Although these sheets may be viewed by users they are protected and can not be changed.  The model contains two additional worksheets: multipliers and household"]
[null,"expenditures.  These worksheets are hidden to protect proprietary data derived from IMPLAN (Minnesota Implan Group)."]
[]
[null,"Is additional technical support available?"]
[null,"Yes, technical support is available by contacting Suzanne Tegen, technical monitor at the National Renewable Energy Laboratory.  She can be reached at 303-384-6939 "]
[null,"or by email at Suzanne.Tegen@nrel.gov."]

{"sheet":"Start","index":2,"n_rows":4,"n_cols":4,"rows_kept":4,"cut":false,"hidden":false,"merged":[]}
[]
[]
[null,"  JEDI - Marine and Hydrokinetic"]
[null,null,null,"Jobs and Economic Development Impact Model"]

{"sheet":"ProjectData","index":3,"n_rows":806,"n_cols":28,"rows_kept":806,"cut":false,"hidden":false,"merged":[[0,1,1,6],[27,1,27,6],[27,7,27,9],[23,0,25,0],[26,0,26,5],[4,0,4,7],[3,0,3,7],[5,0,5,7],[6,0,6,7],[7,0,8,7]]}
["Marine and Hydrokinetic Project Data","Important: Due to the many uncertainties surrounding these new and emerging technologies all cost estimates and resulting impacts should be viewed as preliminary and caution applied when reporting results."]
["Please read instructions before getting started"]
[]
["INSTRUCTIONS:   "]
["1. Begin by entering Project Location (from pull-down list) and other Project Descriptive Data relevant to your particular project.  After inputting Descriptive Data press enter (or cursor to the next cell) to continue."]
["2. Once Descriptive Data is complete, you may choose to utilize the detailed model default values for Project Cost (based on your Descriptive Data) by choosing \"Y\" on line 24 OR you may choose to use your own values entered (modified) under Project Cost Data by choosing \"N\" on line 24.  Choose \"Y\" to accept Project Cost default values or \"N\" to over-ride Project Cost default values and use your own inputs. Important: if you wish to model a system size different from the reference system size, \"N\" is automatically entered on line 24 and you must enter detailed Project Cost Data below."]
["3. Press 'Go To Summary Impacts' Button"]
["NOTES:     Additional information is available by pointing to the red triangles located in cell corners. Only those cells with a white background can accept new values."]
[]
[]
["Project Descriptive Data",null,null,null,null,null,null,null,null,null,null,null,null,null,null,null,null,null,null,{"$f":"IF(B12=\"MYCOUNTY\",IF(B13=\"\",2,1),IF(B12=\"MYREGION\",IF(B13=\"\",2,1),0))","v":0}]
["  Project Location","California",null,{"$f":"IF(B12=\"MYREGION\",IF('User Add-in Location'!F25=0,\"Error - No Regional multiplier and/or PCE data in User Add-in Location\",\"\"),IF(B12=\"MYCOUNTY\",IF('User Add-in Location'!E25=0,\"Error - No County multiplier and/or PCE data in User Add-in Location\",\"\"),\"\"))","v":""}]
["  Population (only required for County/Region analysis)",null,null,{"$f":"IF(B12=\"MYREGION\",IF('User Add-in Location'!F25=0,\"\",IF(B12=\"MYREGION\",\"Enter Region Population\",\"\")),IF(B12=\"MYCOUNTY\",IF('User Add-in Location'!E25=0,\"\",IF(B12=\"MYCOUNTY\",\"Enter County Population\",\"\")),\"\"))","v":""}]
["  Year of Construction/Installation",2011,{"$f":"IF(D13=\"\",\"\",IF(B13<1,\"**Error - Population Data Missing**\",\"\"))","v":""}]
["  System Type","Wave Power"]
["  Reference System Size - Nameplate Capacity (MW)",{"$f":"DefaultData!AI15","v":10}]
["  Project Size - Nameplate Capacity (MW)",{"$f":"B16","v":10},{"$f":"IF(B17=B16,\"\",\"   Enter detailed Project Cost Data below.\")","v":""}]
["  Construction Period (months)",{"$f":"DefaultData!AI14","v":24}]
["  Installed Capital Cost  ($/KW)",{"$f":"DefaultData!AI13","v":5289.7},{"$f":"IF(B24=\"N\",\"    User Revised Capital Cost\",\"\")","v":""},null,null,{"$f":"IF(B24=\"N\",C43,\"\")","v":""},null,null,null,null,null,null,null,null,null,null,"Y"]
["  Annualized O & M Cost (percent of Capital Cost)",{"$f":"DefaultData!AI48","v":6.8161805017297766E-2},{"$f":"IF(B24=\"N\",\"    User Revised O&M Cost\",\"\")","v":""},null,null,{"$f":"IF(B24=\"N\",C52/F19,\"\")","v":""},null,null,null,null,null,null,null,null,null,null,"N"]
["  Money Value (Dollar Year) ",2009,null,{"$f":"IF(B25=\"N\",\"User Revised O&M Cost\",\"\")","v":""}]
[null,null,null,{"$f":"IF(B26=\"N\",\"User Revised O&M Cost\",\"\")","v":""}]
[]
["Utilize Project Cost Data default values? Choose \"Y\" to accept default values below or \"N\" to over-ride default values and utilize new user defined values as entered below.",{"$f":"Q24","v":"Y"},{"$f":"IF(B24=\"y\",\"Press 'Go To Summary Impacts' Button\",IF(B24=\"N\",\"Modify or Enter System Cost Data (change data below).\",\"Error - Re-enter 'Y' or 'N'\"))","v":"Press 'Go To Summary Impacts' Button"},null,null,null,null,null,null,null,null,null,null,null,null,null,{"$f":"IF(B17=B16,\"Y\",\"N\")","v":"Y"}]
[]
[]
["If desired, default values (in cells below - based on Project Descriptive Data entered above) may be restored by pressing the 'Restore Default Values' button.  Note: it is not necessary to restore defaults to incorporate default Project Cost Data in system analysis (simply enter a \"Y\" in cell B24 above).  "]
["Project Cost Data"]
[{"$f":"DefaultData!C14","v":"Installed Capital Costs"},"Cost","Cost ","Percent of","Local"]
[{"$f":"DefaultData!C15","v":"Tidal Power"},"(Million Dollars)","Per KW","Total Cost","Share (%)"]
[{"$f":"DefaultData!C16","v":"  Device"},{"$f":"DefaultData!$D16","v":36.292321206006285},{"$f":"B31*1000/(B$17)","v":3629.2321206006286},{"$f":"IF(B$45=0,\"na\",B31/(B$45))","v":0.64476816094662681},{"$f":"$T31","v":0.25},null,null,null,null,null,null,null,null,null,null,null,null,null,null,{"$f":"IF(B$17=B$16,IF(T$11=0,DefaultData!$G16,IF(T$11=2,\"Pop. Data Missing\",IF($B$13<DefaultData!$H$13,DefaultData!$H16,IF($B$13<DefaultData!$I$13,DefaultData!$O16,IF($B$13<DefaultData!$J$13,DefaultData!$R16,DefaultData!$U16))))),0)","v":0.25},null,null,null,null,{"$f":"DefaultData!$D16","v":36.292321206006285},null,null,{"$f":"$T31","v":0.25}]
[{"$f":"DefaultData!C17","v":"  Underwater Electrical Collector System"},{"$f":"DefaultData!$D17","v":4.8839752903238569},{"$f":"B32*1000/(B$17)","v":488.39752903238571},8.6768541151612102E-2,{"$f":"$T32","v":0},null,null,null,null,null,null,null,null,null,null,null,null,null,null,{"$f":"IF(B$17=B$16,IF(T$11=0,DefaultData!$G17,IF(T$11=2,\"Pop. Data Missing\",IF($B$13<DefaultData!$H$13,DefaultData!$H17,IF($B$13<DefaultData!$I$13,DefaultData!$O17,IF($B$13<DefaultData!$J$13,DefaultData!$R17,DefaultData!$U17))))),0)","v":0},null,null,null,null,{"$f":"DefaultData!$D17","v":4.8839752903238569},null,null,{"$f":"$T32","v":0}]
[{"$f":"DefaultData!C18","v":"  Underwater Transmission Cable"},{"$f":"DefaultData!$D18","v":0.7848685381921775},{"$f":"B33*1000/(B$17)","v":78.486853819217757},1.3943948117357847E-2,{"$f":"$T33","v":0},null,null,null,null,null,null,null,null,null,null,null,null,null,null,{"$f":"IF(B$17=B$16,IF(T$11=0,DefaultData!$G18,IF(T$11=2,\"Pop. Data Missing\",IF($B$13<DefaultData!$H$13,DefaultData!$H18,IF($B$13<DefaultData!$I$13,DefaultData!$O18,IF($B$13<DefaultData!$J$13,DefaultData!$R18,DefaultData!$U18))))),0)","v":0},null,null,null,null,{"$f":"DefaultData!$D18","v":0.7848685381921775},null,null,{"$f":"$T33","v":0}]
[{"$f":"DefaultData!C19","v":"  Cable Landing and Grid Interconnection"},{"$f":"DefaultData!$D19","v":1.1511405226818603},{"$f":"B34*1000/(B$17)","v":115.11405226818604},2.0451123905458175E-2,{"$f":"$T34","v":0},null,null,null,null,null,null,null,null,null,null,null,null,null,null,{"$f":"IF(B$17=B$16,IF(T$11=0,DefaultData!$G19,IF(T$11=2,\"Pop. Data Missing\",IF($B$13<DefaultData!$H$13,DefaultData!$H19,IF($B$13<DefaultData!$I$13,DefaultData!$O19,IF($B$13<DefaultData!$J$13,DefaultData!$R19,DefaultData!$U19))))),0)","v":0},null,null,null,null,{"$f":"DefaultData!$D19","v":1.1511405226818603},null,null,{"$f":"$T34","v":0}]
[{"$f":"DefaultData!C20","v":"  Balance of Plant"},{"$f":"DefaultData!$D20","v":2.0929827685124733},{"$f":"B35*1000/(B$17)","v":209.29827685124732},3.7183861646287591E-2,{"$f":"$T35","v":0.75},null,null,null,null,null,null,null,null,null,null,null,null,null,null,{"$f":"IF(B$17=B$16,IF(T$11=0,DefaultData!$G20,IF(T$11=2,\"Pop. Data Missing\",IF($B$13<DefaultData!$H$13,DefaultData!$H20,IF($B$13<DefaultData!$I$13,DefaultData!$O20,IF($B$13<DefaultData!$J$13,DefaultData!$R20,DefaultData!$U20))))),0)","v":0.75},null,null,null,null,{"$f":"DefaultData!$D20","v":2.0929827685124733},null,null,{"$f":"$T35","v":0.75}]
[{"$f":"DefaultData!C21","v":"  Subtotal"},{"$f":"SUM(B31:B35)","v":45.205288325716651},{"$f":"SUM(C31:C35)","v":4520.5288325716656},0.80311563576734246,null,null,null,null,null,null,null,null,null,null,null,null,null,null,null,null,null,null,null,null,{"$f":"SUM(Y31:Y35)","v":45.205288325716651}]
[{"$f":"DefaultData!C22","v":"Installation/Labor"}]
[{"$f":"DefaultData!C23","v":"  Mooring and Device Installation"},{"$f":"DefaultData!$D23","v":2.6162284606405919},{"$f":"B38*1000/(B$17)","v":261.62284606405922},{"$f":"IF(B$45=0,\"na\",B38/(B$45))","v":4.6479827057859489E-2},{"$f":"$T38","v":0.25},null,null,null,null,null,null,null,null,null,null,null,null,null,null,{"$f":"IF(B$17=B$16,IF(T$11=0,DefaultData!$G23,IF(T$11=2,\"Pop. Data Missing\",IF($B$13<DefaultData!$H$13,DefaultData!$H23,IF($B$13<DefaultData!$I$13,DefaultData!$O23,IF($B$13<DefaultData!$J$13,DefaultData!$R23,DefaultData!$U23))))),0)","v":0.25},null,null,null,null,{"$f":"DefaultData!$D23","v":2.6162284606405919},null,null,{"$f":"$T38","v":0.25}]
[{"$f":"DefaultData!C24","v":"  Underwater Cable Installation"},{"$f":"DefaultData!$D24","v":2.0929827685124733},{"$f":"B39*1000/(B$17)","v":209.29827685124732},3.7183861646287591E-2,{"$f":"$T39","v":0.25},null,null,null,null,null,null,null,null,null,null,null,null,null,null,{"$f":"IF(B$17=B$16,IF(T$11=0,DefaultData!$G24,IF(T$11=2,\"Pop. Data Missing\",IF($B$13<DefaultData!$H$13,DefaultData!$H24,IF($B$13<DefaultData!$I$13,DefaultData!$O24,IF($B$13<DefaultData!$J$13,DefaultData!$R24,DefaultData!$U24))))),0)","v":0.25},null,null,null,null,{"$f":"DefaultData!$D24","v":2.0929827685124733},null,null,{"$f":"$T39","v":0.25}]
[{"$f":"DefaultData!C25","v":"  Cable Landing and Grid Connection"},{"$f":"DefaultData!$D25","v":0.52324569212811833},{"$f":"B40*1000/(B$17)","v":52.324569212811831},9.2959654115718979E-3,{"$f":"$T40","v":0.25},null,null,null,null,null,null,null,null,null,null,null,null,null,null,{"$f":"IF(B$17=B$16,IF(T$11=0,DefaultData!$G25,IF(T$11=2,\"Pop. Data Missing\",IF($B$13<DefaultData!$H$13,DefaultData!$H25,IF($B$13<DefaultData!$I$13,DefaultData!$O25,IF($B$13<DefaultData!$J$13,DefaultData!$R25,DefaultData!$U25))))),0)","v":0.25},null,null,null,null,{"$f":"DefaultData!$D25","v":0.52324569212811833},null,null,{"$f":"$T40","v":0.25}]
[{"$f":"DefaultData!C27","v":"  Subtotal"},{"$f":"SUM(B38:B40)","v":5.2324569212811838},{"$f":"SUM(C38:C40)","v":523.24569212811843},9.2959654115718979E-2,null,null,null,null,null,null,null,null,null,null,null,null,null,null,null,null,null,null,null,null,{"$f":"SUM(Y38:Y40)","v":5.2324569212811838}]
[{"$f":"DefaultData!C28","v":"Permitting Cost"},{"$f":"DefaultData!$D28","v":2.4592547530021567},{"$f":"B42*1000/(B$17)","v":245.92547530021565},4.369103743438793E-2,{"$f":"$T42","v":0.75},null,null,null,null,null,null,null,null,null,null,null,null,null,null,{"$f":"IF(B$17=B$16,IF(T$11=0,DefaultData!$G28,IF(T$11=2,\"Pop. Data Missing\",IF($B$13<DefaultData!$H$13,DefaultData!$H28,IF($B$13<DefaultData!$I$13,DefaultData!$O28,IF($B$13<DefaultData!$J$13,DefaultData!$R28,DefaultData!$U28))))),0)","v":0.75},null,null,null,null,{"$f":"DefaultData!$D28","v":2.4592547530021567},null,null,{"$f":"$T42","v":0.75}]
["Subtotal",{"$f":"B42+B41+B36","v":52.896999999999991},{"$f":"C42+C41+C36","v":5289.7},0.93976632731744936,null,null,null,null,null,null,null,null,null,null,null,null,null,null,null,null,null,null,null,null,{"$f":"Y42+Y41+Y36","v":52.896999999999991}]
["Sales Tax (Materials & Equipment Purchases)",{"$f":"B36*$B75","v":3.3903966244287487},{"$f":"B44*1000/(B$17)","v":339.03966244287483},6.0233672682550685E-2,{"$f":"$T44","v":1},null,null,null,null,null,null,null,null,null,null,null,null,null,null,{"$f":"DefaultData!G31","v":1},null,null,null,null,{"$f":"Y36*$B75","v":3.3903966244287487},null,null,{"$f":"$T44","v":1}]
["Total",{"$f":"B44+B43","v":56.287396624428737},{"$f":"C44+C43","v":5628.7396624428748},1,null,null,null,null,null,null,null,null,null,null,null,null,null,null,null,null,null,null,null,null,{"$f":"Y44+Y43","v":56.287396624428737}]
[]
[{"$f":"DefaultData!C33","v":"Annualized Operating and Maintenance Costs"}]
[null,null,"Cost ","Percent of","Local"]
[null,"Cost","Per KW","Total Cost","Share (%)"]
[{"$f":"DefaultData!C35","v":"Labor"},{"$f":"DefaultData!$D35","v":0.76},{"$f":"B50*10^3/B$17","v":76},{"$f":"IF(B$54=0,\"na\",B50/B$54)","v":0.20313438605278822},{"$f":"$T50","v":1},null,null,null,null,null,null,null,null,null,null,null,null,null,null,{"$f":"IF(B$17=B$16,IF(T$11=0,DefaultData!$G35,IF(T$11=2,\"Pop. Data Missing\",IF($B$13<DefaultData!$H$13,DefaultData!$H35,IF($B$13<DefaultData!$I$13,DefaultData!$O35,IF($B$13<DefaultData!$J$13,DefaultData!$R35,DefaultData!$U35))))),0)","v":1},null,null,null,null,{"$f":"DefaultData!$D35","v":0.76},null,null,{"$f":"$T50","v":1}]
[{"$f":"DefaultData!C36","v":"Materials and Services"},{"$f":"DefaultData!$D36","v":2.8455550000000001},{"$f":"B51*10^3/B$17","v":284.55549999999999},{"$f":"IF(B$54=0,\"na\",B51/B$54)","v":0.76056587882163385},{"$f":"$T51","v":0.5},null,null,null,null,null,null,null,null,null,null,null,null,null,null,{"$f":"IF(B$17=B$16,IF(T$11=0,DefaultData!$G36,IF(T$11=2,\"Pop. Data Missing\",IF($B$13<DefaultData!$H$13,DefaultData!$H36,IF($B$13<DefaultData!$I$13,DefaultData!$O36,IF($B$13<DefaultData!$J$13,DefaultData!$R36,DefaultData!$U36))))),0)","v":0.5},null,null,null,null,{"$f":"DefaultData!$D36","v":2.8455550000000001},null,null,{"$f":"$T51","v":0.5}]
["Subtotal",{"$f":"B51+B50","v":3.6055549999999998},{"$f":"B52*10^3/B$17","v":360.55549999999999},{"$f":"IF(B$54=0,\"na\",B52/B$54)","v":0.96370026487442206},null,null,null,null,null,null,null,null,null,null,null,null,null,null,null,null,null,null,null,null,{"$f":"Y51+Y50","v":3.6055549999999998}]
["Sales Tax (Materials & Equipment Purchases)",{"$f":"DefaultData!$D38","v":0.13581057954545456},{"$f":"B53*10^3/B$17","v":13.581057954545454},{"$f":"IF(B$54=0,\"na\",B53/B$54)","v":3.6299735125577985E-2},{"$f":"$T53","v":1},null,null,null,null,null,null,null,null,null,null,null,null,null,null,{"$f":"DefaultData!G38","v":1},null,null,null,null,{"$f":"DefaultData!$D38","v":0.13581057954545456},null,null,{"$f":"$T53","v":1}]
["Total (without property taxes and debt financing)",{"$f":"B53+B52","v":3.7413655795454543},{"$f":"B54*10^3/B$17","v":374.13655795454542},{"$f":"IF(B$54=0,\"na\",B54/B$54)","v":1},null,null,null,null,null,null,null,null,null,null,null,null,null,null,null,null,null,null,null,null,{"$f":"Y53+Y52","v":3.7413655795454543}]
[]
[{"$f":"DefaultData!C41","v":"Other Parameters"}]
[{"$f":"DefaultData!C42","v":"Financial Parameters"},null,null,"Local"]
[{"$f":"DefaultData!C43","v":"Debt Financing"},null,null,"Share (%)"]
[{"$f":"DefaultData!C44","v":"  Percentage financed"},{"$f":"DefaultData!$D44","v":0.2},null,{"$f":"DefaultData!$F44","v":0},null,null,null,null,null,null,null,null,null,null,null,null,null,null,null,{"$f":"DefaultData!$F44","v":0},null,null,null,null,{"$f":"DefaultData!$D44","v":0.2},null,{"$f":"DefaultData!$F44","v":0}]
[{"$f":"DefaultData!C45","v":"  Years financed (term)"},{"$f":"DefaultData!$D45","v":20},{"$f":"IF(B60<=0,\"  **Error, term (years) must be entered.\",\"\")","v":""},null,null,null,null,null,null,null,null,null,null,null,null,null,null,null,null,null,null,null,null,null,{"$f":"DefaultData!$D45","v":20}]
[{"$f":"DefaultData!C46","v":"  Interest rate"},{"$f":"DefaultData!$D46","v":0.1},null,null,null,null,null,null,null,null,null,null,null,null,null,null,null,null,null,null,null,null,null,null,{"$f":"DefaultData!$D46","v":0.1}]
[{"$f":"DefaultData!C48","v":"Equity Financing/Repayment"}]
[{"$f":"DefaultData!C49","v":"  Percentage equity"},{"$f":"DefaultData!$D49","v":0.8},null,null,null,null,null,null,null,null,null,null,null,null,null,null,null,null,null,null,null,null,null,null,{"$f":"DefaultData!$D49","v":0.8}]
[{"$f":"DefaultData!C50","v":"  Individual Investors (percent of equity)"},{"$f":"DefaultData!$D50","v":0},null,{"$f":"DefaultData!$F50","v":1},null,null,null,null,null,null,null,null,null,null,null,null,null,null,null,{"$f":"DefaultData!$F50","v":1},null,null,null,null,{"$f":"DefaultData!$D50","v":0},null,{"$f":"DefaultData!$F50","v":1}]
[{"$f":"DefaultData!C51","v":"  Corporate Investors (percent of equity)"},{"$f":"1-B64","v":1},null,{"$f":"DefaultData!$F51","v":0},null,null,null,null,null,null,null,null,null,null,null,null,null,null,null,{"$f":"DefaultData!$F51","v":0},null,null,null,null,null,null,{"$f":"DefaultData!$F51","v":0}]
[{"$f":"DefaultData!C52","v":"  Return on equity"},{"$f":"DefaultData!$D52","v":0.12},null,null,null,null,null,null,null,null,null,null,null,null,null,null,null,null,null,null,null,null,null,null,{"$f":"DefaultData!$D52","v":0.12}]
[{"$f":"DefaultData!C53","v":"  Repayment term (years)"},{"$f":"DefaultData!$D53","v":10},null,null,null,null,null,null,null,null,null,null,null,null,null,null,null,null,null,null,null,null,null,null,{"$f":"DefaultData!$D53","v":10}]
[{"$f":"DefaultData!C54","v":"Tax Parameters"}]
[{"$f":"DefaultData!C55","v":"  Local Property Tax (percent of taxable value)"},{"$f":"DefaultData!$D55","v":0},null,null,null,null,null,null,null,null,null,null,null,null,null,null,null,null,null,null,null,null,null,null,{"$f":"DefaultData!$D55","v":0}]
[{"$f":"DefaultData!C56","v":"  Assessed Value (percent of construction cost)"},{"$f":"DefaultData!$D56","v":1},null,null,null,null,null,null,null,null,null,null,null,null,null,null,null,null,null,null,null,null,null,null,{"$f":"DefaultData!$D56","v":1}]
[{"$f":"DefaultData!C57","v":"  Taxable Value (percent of assessed value)"},{"$f":"DefaultData!$D57","v":1},null,null,null,null,null,null,null,null,null,null,null,null,null,null,null,null,null,null,null,null,null,null,{"$f":"DefaultData!$D57","v":1}]
[{"$f":"DefaultData!C58","v":"  Taxable Value ( million$ - if applicable)"},{"$f":"+B71*B70*B43","v":52.896999999999991},null,null,null,null,null,null,null,null,null,null,null,null,null,null,null,null,null,null,null,null,null,null,{"$f":"+Y71*Y70*Y43","v":52.896999999999991}]
["  Property Tax Exemption (percent of local taxes)",{"$f":"DefaultData!$D59","v":1},null,null,null,null,null,null,null,null,null,null,null,null,null,null,null,null,null,null,null,null,null,null,{"$f":"DefaultData!$D59","v":1}]
["  Local Property Taxes",{"$f":"B72*B69*(1-B73)","v":0},null,{"$f":"DefaultData!$F60","v":1},null,null,null,null,null,null,null,null,null,null,null,null,null,null,null,{"$f":"DefaultData!$F60","v":1},null,null,null,null,{"$f":"Y72*Y69*(1-Y73)","v":0},null,{"$f":"DefaultData!$F60","v":1}]
["  Local Sales Tax Rate",{"$f":"DefaultData!$D61","v":7.4999999999999997E-2},null,null,null,null,null,null,null,null,null,null,null,null,null,null,null,null,null,null,null,null,null,null,{"$f":"DefaultData!$D61","v":7.4999999999999997E-2}]
[{"$f":"DefaultData!C62","v":"Lease Cost (if applicable)"},{"$f":"DefaultData!$D62","v":0},null,{"$f":"DefaultData!$F62","v":1},null,null,null,null,null,null,null,null,null,null,null,null,null,null,null,{"$f":"DefaultData!$F62","v":1},null,null,null,null,{"$f":"DefaultData!$D62","v":0},null,{"$f":"DefaultData!$F62","v":1}]
[]
[]
[]
[]
[]
[]
[]
[]
[]
[]
[]
[]
[]
[]
[]
[]
[]
[]
[]
[]
[]
[]
[]
[]
[]
[]
[]
[]
[]
[]
[]
[]
[]
[]
[]
[]
[]
[]
[]
[]
[]
[]
[]
[]
[]
[]
[]
[]
[]
[]
[]
[]
[]
[]
[]
[]
[]
[]
[]
[]
[]
[]
[]
[]
[]
[]
[]
[]
[]
[]
[]
[]
[]
[]
[]
[]
[]
[]
[]
[]
[]
[]
[]
[]
[]
[]
[]
[]
[]
[]
[]
[]
[]
[]
[]
[]
[]
[]
[]
[]
[]
[]
[]
[]
[]
[]
[]
[]
[]
[]
[]
[]
[]
[]
[]
[]
[]
[]
[]
[]
[]
[]
[]
[]
[]
[]
[]
[]
[]
[]
[]
[]
[]
[]
[]
[]
[]
[]
[]
[]
[]
[]
[]
[]
[]
[]
[]
[]
[]
[]
[]
[]
[]
[]
[]
[]
[]
[]
[]
[]
[]
[]
[]
[]
[]
[]
[]
[]
[]
[]
[]
[]
[]
[]
[]
[]
[]
[]
[]
[]
[]
[]
[]
[]
[]
[]
[]
[]
[]
[]
[]
[]
[]
[]
[]
[]
[]
[]
[]
[]
[]
[]
[]
[]
[]
[]
[]
[]
[]
[]
[]
[]
[]
[]
[]
[]
[]
[]
[]
[]
[]
[]
[]
[]
[]
[]
[]
[]
[]
[]
[]
[]
[]
[]
[]
[]
[]
[]
[]
[]
[]
[]
[]
[]
[]
[]
[]
[]
[]
[]
[]
[]
[]
[]
[]
[]
[]
[]
[]
[]
[]
[]
[]
[]
[]
[]
[]
[]
[]
[]
[]
[]
[]
[]
[]
[]
[]
[]
[]
[]
[]
[]
[]
[]
[]
[]
[]
[]
[]
[]
[]
[]
[]
[]
[]
[]
[]
[]
[]
[]
[]
[]
[]
[]
[]
[]
[]
[]
[]
[]
[]
[]
[]
[]
[]
[]
[]
[]
[]
[]
[]
[]
[]
[]
[]
[]
[]
[]
[]
[]
[]
[]
[]
[]
[]
[]
[]
[]
[]
[]
[]
[]
[]
[]
[]
[]
[]
[]
[]
[]
[]
[]
[]
[]
[]
[]
[]
[]
[]
[]
[]
[]
[]
[]
[]
[]
[]
[]
[]
[]
[]
[]
[]
[]
[]
[]
[]
[]
[]
[]
[]
[]
[]
[]
[]
[]
[]
[]
[]
[]
[]
[]
[]
[]
[]
[]
[]
[]
[]
[]
[]
[]
[]
[]
[]
[]
[]
[]
[]
[]
[]
[]
[]
[]
[]
[]
[]
[]
[]
[]
[]
[]
[]
[]
[]
[]
[]
[]
[]
[]
[]
[]
[]
[]
[]
[]
[]
[]
[]
[]
[]
[]
[]
[]
[]
[]
[]
[]
[]
[]
[]
[]
[]
[]
[]
[]
[]
[]
[]
[]
[]
[]
[]
[]
[]
[]
[]
[]
[]
[]
[]
[]
[]
[]
[]
[]
[]
[]
[]
[]
[]
[]
[]
[]
[]
[]
[]
[]
[]
[]
[]
[]
[]
[]
[]
[]
[]
[]
[]
[]
[]
[]
[]
[]
[]
[]
[]
[]
[]
[]
[]
[]
[]
[]
[]
[]
[]
[]
[]
[]
[]
[]
[]
[]
[]
[]
[]
[]
[]
[]
[]
[]
[]
[]
[]
[]
[]
[]
[]
[]
[]
[]
[]
[]
[]
[]
[]
[]
[]
[]
[]
[]
[]
[]
[]
[]
[]
[]
[]
[]
[]
[]
[]
[]
[]
[]
[]
[]
[]
[]
[]
[]
[]
[]
[]
[]
[]
[]
[]
[]
[]
[]
[]
[]
[]
[]
[]
[]
[]
[]
[]
[]
[]
[]
[]
[]
[]
[]
[]
[]
[]
[]
[]
[]
[]
[]
[]
[]
[]
[]
[]
[]
[]
[]
[]
[]
[]
[]
[]
[]
[]
[]
[]
[]
[]
[]
[]
[]
[]
[]
[]
[]
[]
[]
[]
[]
[]
[]
[]
[]
[]
[]
[]
[]
[]
[]
[]
[]
[]
[]
[]
[]
[]
[]
[]
[]
[]
[]
[]
[]
[]
[]
[null,null,null,null,null,null,null,null,null,null,null,null,null,null,null,{"$f":"DefaultData!Y57","v":"Wave Power"}]
[null,null,null,null,null,null,null,null,null,null,null,null,null,null,null,{"$f":"IF(DefaultData!Y58=0,\"\",DefaultData!Y58)","v":"Tidal Power"}]
[null,null,null,null,null,null,null,null,null,null,null,null,null,null,null,{"$f":"IF(DefaultData!Y59=0,\"\",DefaultData!Y59)","v":"Ocean Current"}]
[null,null,null,null,null,null,null,null,null,null,null,null,null,null,null,{"$f":"IF(DefaultData!Y60=0,\"\",DefaultData!Y60)","v":"River Current"}]
[]
[]
[]
[]
[]
[]
[]
[]
[]
[]
[null,null,null,null,null,null,null,null,null,null,null,null,null,null,{"$f":"('User Add-in Location'!B10)","v":"MyCounty"}]
[null,null,null,null,null,null,null,null,null,null,null,null,null,null,{"$f":"('User Add-in Location'!C10)","v":"MyRegion"}]
[null,null,null,null,null,null,null,null,null,null,null,null,null,null,"Alabama"]
[null,null,null,null,null,null,null,null,null,null,null,null,null,null,"Alaska"]
[null,null,null,null,null,null,null,null,null,null,null,null,null,null,"Arizona"]
[null,null,null,null,null,null,null,null,null,null,null,null,null,null,"Arkansas"]
[null,null,null,null,null,null,null,null,null,null,null,null,null,null,"California"]
[null,null,null,null,null,null,null,null,null,null,null,null,null,null,"Colorado"]
[null,null,null,null,null,null,null,null,null,null,null,null,null,null,"Connecticut"]
[null,null,null,null,null,null,null,null,null,null,null,null,null,null,"Delaware"]
[null,null,null,null,null,null,null,null,null,null,null,null,null,null,"District of Columbia"]
[null,null,null,null,null,null,null,null,null,null,null,null,null,null,"Florida"]
[null,null,null,null,null,null,null,null,null,null,null,null,null,null,"Georgia"]
[null,null,null,null,null,null,null,null,null,null,null,null,null,null,"Hawaii"]
[null,null,null,null,null,null,null,null,null,null,null,null,null,null,"Idaho"]
[null,null,null,null,null,null,null,null,null,null,null,null,null,null,"Illinois"]
[null,null,null,null,null,null,null,null,null,null,null,null,null,null,"Indiana"]
[null,null,null,null,null,null,null,null,null,null,null,null,null,null,"Iowa"]
[null,null,null,null,null,null,null,null,null,null,null,null,null,null,"Kansas"]
[null,null,null,null,null,null,null,null,null,null,null,null,null,null,"Kentucky"]
[null,null,null,null,null,null,null,null,null,null,null,null,null,null,"Louisiana"]
[null,null,null,null,null,null,null,null,null,null,null,null,null,null,"Maine"]
[null,null,null,null,null,null,null,null,null,null,null,null,null,null,"Maryland"]
[null,null,null,null,null,null,null,null,null,null,null,null,null,null,"Massachusetts"]
[null,null,null,null,null,null,null,null,null,null,null,null,null,null,"Michigan"]
[null,null,null,null,null,null,null,null,null,null,null,null,null,null,"Minnesota"]
[null,null,null,null,null,null,null,null,null,null,null,null,null,null,"Mississippi"]
[null,null,null,null,null,null,null,null,null,null,null,null,null,null,"Missouri"]
[null,null,null,null,null,null,null,null,null,null,null,null,null,null,"Montana"]
[null,null,null,null,null,null,null,null,null,null,null,null,null,null,"Nebraska"]
[null,null,null,null,null,null,null,null,null,null,null,null,null,null,"Nevada"]
[null,null,null,null,null,null,null,null,null,null,null,null,null,null,"New Hampshire"]
[null,null,null,null,null,null,null,null,null,null,null,null,null,null,"New Jersey"]
[null,null,null,null,null,null,null,null,null,null,null,null,null,null,"New Mexico"]
[null,null,null,null,null,null,null,null,null,null,null,null,null,null,"New York"]
[null,null,null,null,null,null,null,null,null,null,null,null,null,null,"North Carolina"]
[null,null,null,null,null,null,null,null,null,null,null,null,null,null,"North Dakota"]
[null,null,null,null,null,null,null,null,null,null,null,null,null,null,"Ohio"]
[null,null,null,null,null,null,null,null,null,null,null,null,null,null,"Oklahoma"]
[null,null,null,null,null,null,null,null,null,null,null,null,null,null,"Oregon"]
[null,null,null,null,null,null,null,null,null,null,null,null,null,null,"Pennsylvania"]
[null,null,null,null,null,null,null,null,null,null,null,null,null,null,"Rhode Island"]
[null,null,null,null,null,null,null,null,null,null,null,null,null,null,"South Carolina"]
[null,null,null,null,null,null,null,null,null,null,null,null,null,null,"South Dakota"]
[null,null,null,null,null,null,null,null,null,null,null,null,null,null,"Tennessee"]
[null,null,null,null,null,null,null,null,null,null,null,null,null,null,"Texas"]
[null,null,null,null,null,null,null,null,null,null,null,null,null,null,"United States"]
[null,null,null,null,null,null,null,null,null,null,null,null,null,null,"Utah"]
[null,null,null,null,null,null,null,null,null,null,null,null,null,null,"Vermont"]
[null,null,null,null,null,null,null,null,null,null,null,null,null,null,"Virginia"]
[null,null,null,null,null,null,null,null,null,null,null,null,null,null,"Washington"]
[null,null,null,null,null,null,null,null,null,null,null,null,null,null,"West Virginia"]
[null,null,null,null,null,null,null,null,null,null,null,null,null,null,"Wisconsin"]
[null,null,null,null,null,null,null,null,null,null,null,null,null,null,"Wyoming"]

{"sheet":"SummaryResults","index":4,"n_rows":96,"n_cols":64,"rows_kept":96,"cut":false,"hidden":false,"merged":[]}
[{"$f":"CONCATENATE(\"Marine and Hydrokinetic - Project Data Summary based on \",$AE$40, \" values\")","v":"Marine and Hydrokinetic - Project Data Summary based on model default values"},null,null,null,null,null,null,null,null,null,null,null,null,null,null,null,null,null,null,null,null,null,null,null,null,null,null,null,null,null,null,null,null,null,null,null,null,null,null,null,null,null,null,null,null,null,null,null,null,null,null,null,null,{"$f":"Summary_Results","v":"Marine and Hydrokinetic - Project Data Summary based on model default values"},null,null,null,null,null,{"$f":"Summary_Results","v":"Marine and Hydrokinetic - Project Data Summary based on model default values"}]
["Project Location",null,{"$f":"IF(ProjectData!B12=\"MyCounty\",'User Add-in Location'!B3,IF(ProjectData!B12=\"MyRegion\",'User Add-in Location'!B4,ProjectData!B12))","v":"California"},null,null,null,null,null,null,null,null,null,null,null,null,null,null,null,null,null,null,null,null,null,null,null,null,null,null,null,null,null,null,null,null,null,null,null,null,null,null,null,null,null,null,null,null,null,null,null,null,null,null,"Project Location",null,{"$f":"C2","v":"California"},null,null,null,"  Project Location",{"$f":"ProjectData!B12","v":"California"},null,{"$f":"IF(BI2=\"MYREGION\",IF('User Add-in Location'!BL14=0,\"Error - No Regional multiplier data in User Add-in Location\",\"\"),IF(BI2=\"MYCOUNTY\",IF('User Add-in Location'!BK14=0,\"Error - No County multiplier data in User Add-in Location\",\"\"),\"\"))","v":""}]
["Year of Construction or Installation",null,{"$f":"ProjectData!B14","v":2011},null,null,null,null,null,null,null,null,null,null,null,null,null,null,null,null,null,null,null,null,null,null,null,null,null,null,null,null,null,null,null,null,null,null,null,null,null,null,null,null,null,null,null,null,null,null,null,null,null,null,"Year of Construction or Installation",null,{"$f":"C3","v":2011},null,null,null,"  Population (only required for County/Region analysis)",{"$f":"IF(ProjectData!B13>0,ProjectData!B13,\"\")","v":""},null,{"$f":"IF(BI2=\"MYREGION\",IF('User Add-in Location'!BL14=0,\"\",IF(BI2=\"MYREGION\",\"Enter Region Population\",\"\")),IF(BI2=\"MYCOUNTY\",IF('User Add-in Location'!BK14=0,\"\",IF(BI2=\"MYCOUNTY\",\"Enter County Population\",\"\")),\"\"))","v":""}]
["Reference System Size - Nameplate Capacity (MW)",null,{"$f":"ProjectData!B16","v":10},{"$f":"ProjectData!D12","v":""},null,null,null,null,null,null,null,null,null,null,null,null,null,null,null,null,null,null,null,null,null,null,null,null,null,null,null,null,null,null,null,null,null,null,null,null,null,null,null,null,null,null,null,null,null,null,null,null,null,"Reference System Size - Nameplate Capacity (MW)",null,{"$f":"C4","v":10},null,null,null,"  Year of Construction or Installation",{"$f":"ProjectData!B14","v":2011},{"$f":"IF(BK3=\"\",\"\",IF(BI3<1,\"**Error - Population Data Missing**\",\"\"))","v":""}]
["Project Size - Nameplate Capacity (MW)",null,{"$f":"ProjectData!B17","v":10},null,null,null,null,null,null,null,null,null,null,null,null,null,null,null,null,null,null,null,null,null,null,null,null,null,null,null,null,null,null,null,null,null,null,null,null,null,null,null,null,null,null,null,null,null,null,null,null,null,null,"Total Project Size - Nameplate Capacity (MW)",null,{"$f":"C5","v":10},null,null,null,"  System Type",{"$f":"ProjectData!B15","v":"Wave Power"}]
["Construction Period (months)",null,{"$f":"ProjectData!B18","v":24},null,null,null,null,null,null,null,null,null,null,null,null,null,null,null,null,null,null,null,null,null,null,null,null,null,null,null,null,null,null,null,null,null,null,null,null,null,null,null,null,null,null,null,null,null,null,null,null,null,null,"Construction Period (months)",null,24,null,null,null,"  Reference System Size - Nameplate Capacity (MW)",{"$f":"ProjectData!B17","v":10}]
["System Type",null,{"$f":"ProjectData!B15","v":"Wave Power"},null,null,null,null,null,null,null,null,null,null,null,null,null,null,null,null,null,null,null,null,null,null,null,null,null,null,null,null,null,null,null,null,null,null,null,null,null,null,null,null,null,null,null,null,null,null,null,null,null,null,"System Type",null,"Wave Power",null,null,null,"  Total Project Size - Nameplate Capacity (MW)",{"$f":"ProjectData!B17","v":10}]
["System Cost ($/KW)",null,{"$f":"SummaryResults!C11*10^6/(SummaryResults!C5*1000)","v":5628.7396624428739},null,null,null,null,null,null,null,null,null,null,null,null,null,null,null,null,null,null,null,null,null,null,null,null,null,null,null,null,null,null,null,null,null,null,null,null,null,null,null,null,null,null,null,null,null,null,null,null,null,null,"System Cost ($/KW)",null,5628.7396624428739,null,null,null,"  Construction Period (months)",{"$f":"ProjectData!B18","v":24}]
["Annualized O & M Cost (percent of Capital Cost)",null,{"$f":"IF(B63=0,\"na\",B71/B63)","v":6.816180501729778E-2},null,null,null,null,null,null,null,null,null,null,null,null,null,null,null,null,null,null,null,null,null,null,null,null,null,null,null,null,null,null,null,null,null,null,null,null,null,null,null,null,null,null,null,null,null,null,null,null,null,null,"Annualized O & M Cost (percent of Capital Cost)",null,6.816180501729778E-2,null,null,null,"  System Cost ($/KW)",{"$f":"C8","v":5628.7396624428739}]
["Money Value (Dollar Year) ",null,{"$f":"ProjectData!B21","v":2009},null,null,null,null,null,null,null,null,null,null,null,null,null,null,null,null,null,null,null,null,null,null,null,null,null,null,null,null,null,null,null,null,null,null,null,null,null,null,null,null,null,null,null,null,null,null,null,null,null,null,"Money Value (Dollar Year) ",null,2009,null,null,null,"Annualized O & M Cost (percent of Capital Cost)",{"$f":"C9","v":6.816180501729778E-2}]
["Project Construction or Installation Cost (million$)",null,{"$f":"Calculations!D21","v":56.287396624428737},null,null,null,null,null,null,null,null,null,null,null,null,null,null,null,null,null,null,null,null,null,null,null,null,null,null,null,null,null,null,null,null,null,null,null,null,null,null,null,null,null,null,null,null,null,null,null,null,null,null,"Project Construction or Installation Cost",null,56.287396624428737,null,null,null,"  Money Value (Dollar Year) ",{"$f":"ProjectData!B21","v":2009}]
["  Local Spending (million$)",null,{"$f":"Calculations!F58","v":17.185764101556867},null,null,null,null,null,null,null,null,null,null,null,null,null,null,null,null,null,null,null,null,null,null,null,null,null,null,null,null,null,null,null,null,null,null,null,null,null,null,null,null,null,null,null,null,null,null,null,null,null,null,"  Local Spending",null,17.185764101556867]
["Total Annual Operational Expenses (million$)",null,{"$f":"C14+C16","v":11.707464343675078},null,null,null,null,null,null,null,null,null,null,null,null,null,null,null,null,null,null,null,null,null,null,null,null,null,null,null,null,null,null,null,null,null,null,null,null,null,null,null,null,null,null,null,null,null,null,null,null,null,null,"Total Annual Operational Expenses",null,11.707464343675078,null,null,null,"Project Cost Data"]
["  Direct Operating and Maintenance Costs (million$)",null,{"$f":"Calculations!D76","v":3.6055549999999998},null,null,null,null,null,null,null,null,null,null,null,null,null,null,null,null,null,null,null,null,null,null,null,null,null,null,null,null,null,null,null,null,null,null,null,null,null,null,null,null,null,null,null,null,null,null,null,null,null,null,"  Direct Operating and Maintenance Costs",null,3.6055549999999998,null,null,null,{"$f":"ProjectData!A29","v":"Installed Capital Costs"},{"$f":"ProjectData!B29","v":"Cost"},{"$f":"ProjectData!C29","v":"Cost "},{"$f":"ProjectData!D29","v":"Percent of"},{"$f":"ProjectData!E29","v":"Local"}]
["    Local Spending (million$)",null,{"$f":"Calculations!G76","v":2.1827775000000003},null,null,null,null,null,null,null,null,null,null,null,null,null,null,null,null,null,null,null,null,null,null,null,null,null,null,null,null,null,null,null,null,null,null,null,null,null,null,null,null,null,null,null,null,null,null,null,null,null,null,"    Local Spending",null,2.1827775000000003,null,null,null,{"$f":"ProjectData!A30","v":"Tidal Power"},null,{"$f":"ProjectData!C30","v":"Per KW"},{"$f":"ProjectData!D30","v":"Total Cost"},{"$f":"ProjectData!E30","v":"Share (%)"}]
["  Other Annual Costs (million$)",null,{"$f":"Calculations!E76","v":8.1019093436750786},null,null,null,null,null,null,null,null,null,null,null,null,null,null,null,null,null,null,null,null,null,null,null,null,null,null,null,null,null,null,null,null,null,null,null,null,null,null,null,null,null,null,null,null,null,null,null,null,null,null,"  Other Annual Costs",null,8.1019093436750786,null,null,null,{"$f":"ProjectData!A31","v":"  Device"},{"$f":"B51","v":36.292321206006285},{"$f":"BI16*10^6/(BI$7*1000)","v":3629.2321206006291},{"$f":"IF(BI$29=0,\"na\",BI16/BI$29)","v":0.64476816094662681},{"$f":"C51","v":0.25}]
["    Local Spending (million$)",null,{"$f":"Calculations!H76","v":0.1358105795454545},null,null,null,null,null,null,null,null,null,null,null,null,null,null,null,null,null,null,null,null,null,null,null,null,null,null,null,null,null,null,null,null,null,null,null,null,null,null,null,null,null,null,null,null,null,null,null,null,null,null,"    Local Spending",null,0.1358105795454545,null,null,null,{"$f":"ProjectData!A32","v":"  Underwater Electrical Collector System"},4.8839752903238569,488.39752903238571,8.6768541151612102E-2,{"$f":"C52","v":0}]
["      Debt Payments (million$)",null,{"$f":"Calculations!G70","v":0},null,null,null,null,null,null,null,null,null,null,null,null,null,null,null,null,null,null,null,null,null,null,null,null,null,null,null,null,null,null,null,null,null,null,null,null,null,null,null,null,null,null,null,null,null,null,null,null,null,null,"      Debt Payments ",null,0,null,null,null,{"$f":"ProjectData!A33","v":"  Underwater Transmission Cable"},0.7848685381921775,78.486853819217757,1.3943948117357847E-2,{"$f":"C53","v":0}]
["      Property Taxes (million$)",null,{"$f":"Calculations!G73","v":0},null,null,null,null,null,null,null,null,null,null,null,null,null,null,null,null,null,null,null,null,null,null,null,null,null,null,null,null,null,null,null,null,null,null,null,null,null,null,null,null,null,null,null,null,null,null,null,null,null,null,"      Property Taxes",null,0,null,null,null,{"$f":"ProjectData!A34","v":"  Cable Landing and Grid Interconnection"},1.1511405226818603,115.11405226818603,2.0451123905458175E-2,{"$f":"C54","v":0}]
["      Sales Tax (million$)",null,{"$f":"Calculations!G69","v":0.13581057954545456},null,null,null,null,null,null,null,null,null,null,null,null,null,null,null,null,null,null,null,null,null,null,null,null,null,null,null,null,null,null,null,null,null,null,null,null,null,null,null,null,null,null,null,null,null,null,null,null,null,null,"      Sales Tax",null,0.13581057954545456,null,null,null,{"$f":"ProjectData!A35","v":"  Balance of Plant"},2.0929827685124733,209.29827685124735,3.7183861646287591E-2,{"$f":"C55","v":0.75}]
[null,null,null,null,null,null,null,null,null,null,null,null,null,null,null,null,null,null,null,null,null,null,null,null,null,null,null,null,null,null,null,null,null,null,null,null,null,null,null,null,null,null,null,null,null,null,null,null,null,null,null,null,null,null,null,null,null,null,null,{"$f":"ProjectData!A36","v":"  Subtotal"},45.205288325716651,4520.5288325716656,0.80311563576734246]
["Local Economic Impacts - Summary Results",null,null,null,null,null,null,null,null,null,null,null,null,null,null,null,null,null,null,null,null,null,null,null,null,null,null,null,null,null,null,null,null,null,null,null,null,null,null,null,null,null,null,null,null,null,null,null,null,null,null,null,null,"Local Economic Impacts - Summary Results",null,null,null,null,null,{"$f":"ProjectData!A37","v":"Installation/Labor"}]
[null,"Jobs","Earnings","Output","Value Added",null,null,null,null,null,null,null,null,null,null,null,null,null,null,null,null,null,null,null,null,null,null,null,null,null,null,null,null,null,null,null,null,null,null,null,null,null,null,null,null,null,null,null,null,null,null,null,null,null,"Jobs","Earnings","Output","Value Added",null,{"$f":"ProjectData!A38","v":"  Mooring and Device Installation"},{"$f":"B58","v":2.6162284606405919},{"$f":"BI23*10^6/(BI$7*1000)","v":261.62284606405922},{"$f":"IF(BI$29=0,\"na\",BI23/BI$29)","v":4.6479827057859489E-2},{"$f":"C58","v":0.25}]
["During construction and installation period",null,{"$f":"CONCATENATE(\"$MM (\",$C10,\")\")","v":"$MM (2009)"},{"$f":"CONCATENATE(\"$MM (\",$C10,\")\")","v":"$MM (2009)"},{"$f":"CONCATENATE(\"$MM (\",$C10,\")\")","v":"$MM (2009)"},null,null,null,null,null,null,null,null,null,null,null,null,null,null,null,null,null,null,null,null,null,null,null,null,null,null,null,null,null,null,null,null,null,null,null,null,null,null,null,null,null,null,null,null,null,null,null,null,"During construction and installation period",null,{"$f":"C24","v":"$MM (2009)"},"$MM (2009)","$MM (2009)",null,{"$f":"ProjectData!A39","v":"  Underwater Cable Installation"},{"$f":"B59","v":2.0929827685124733},209.29827685124735,3.7183861646287591E-2,{"$f":"C59","v":0.25}]
["   Project Development and Onsite Labor Impacts",{"$f":"Calculations!AH42","v":18.875566974776188},{"$f":"Calculations!AI42","v":1.3006629001340695},{"$f":"Calculations!AJ42","v":2.7441600558287824},{"$f":"Calculations!AK42","v":1.8173729083127097},null,null,null,null,null,null,null,null,null,null,null,null,null,null,null,null,null,null,null,null,null,null,null,null,null,null,null,null,null,null,null,null,null,null,null,null,null,null,null,null,null,null,null,null,null,null,null,null,"   Project Development and Onsite Labor Impacts",{"$f":"B25","v":18.875566974776188},1.3006629001340695,2.7441600558287824,1.8173729083127097,null,{"$f":"ProjectData!A40","v":"  Cable Landing and Grid Connection"},{"$f":"B60","v":0.52324569212811833},52.324569212811838,9.2959654115718979E-3,{"$f":"C60","v":0.25}]
["     Construction and Installation Labor",{"$f":"Calculations!AH43","v":4.766914119657935},{"$f":"Calculations!AI43","v":0.5419734270174168},null,null,null,null,null,null,null,null,null,null,null,null,null,null,null,null,null,null,null,null,null,null,null,null,null,null,null,null,null,null,null,null,null,null,null,null,null,null,null,null,null,null,null,null,null,null,null,null,null,null,"     Construction and Installation Labor",4.766914119657935,{"$f":"C26","v":0.5419734270174168},null,null,null,{"$f":"ProjectData!A41","v":"  Subtotal"},{"$f":"B61","v":5.2324569212811838},523.24569212811843,9.2959654115718979E-2]
["     Construction and Installation Related Services",{"$f":"Calculations!AH44","v":14.108652855118253},{"$f":"Calculations!AI44","v":0.75868947311665258},null,null,null,null,null,null,null,null,null,null,null,null,null,null,null,null,null,null,null,null,null,null,{"$f":"IF(C6<12,B30*(C6/12),B30/(C6/12))","v":71.201382161447611},null,null,null,null,null,null,null,null,null,null,null,null,null,null,null,null,null,null,null,null,null,null,null,null,null,null,null,"     Construction and Installation Related Services",14.108652855118253,{"$f":"C27","v":0.75868947311665258},null,null,null,{"$f":"ProjectData!A42","v":"Permitting Cost"},{"$f":"B62","v":2.4592547530021567},245.92547530021565,4.369103743438793E-2]
["   Equipment and Supply Chain Impacts",{"$f":"Calculations!AH45","v":74.86329176825825},{"$f":"Calculations!AI45","v":5.214560813683387},{"$f":"Calculations!AJ45","v":18.161499536661751},{"$f":"Calculations!AK45","v":8.8136977819318787},null,null,null,null,null,null,null,null,null,null,null,null,null,null,null,null,null,null,null,null,{"$f":"ROUND(Z27,)","v":71},null,null,null,null,null,null,null,null,null,null,null,null,null,null,null,null,null,null,null,null,null,null,null,null,null,null,null,"   Module and Supply Chain Impacts",74.86329176825825,{"$f":"C28","v":5.214560813683387},{"$f":"D28","v":18.161499536661751},8.8136977819318787,null,{"$f":"ProjectData!A44","v":"Sales Tax (Materials & Equipment Purchases)"},{"$f":"B64","v":3.3903966244287487},339.03966244287489,6.0233672682550685E-2,{"$f":"C64","v":1}]
["   Induced Impacts",{"$f":"Calculations!AH46","v":48.663905579860803},{"$f":"Calculations!AI46","v":2.8143489196916627},{"$f":"Calculations!AJ46","v":7.9253821180437969},{"$f":"Calculations!AK46","v":4.8666208820000492},null,null,null,null,null,null,null,null,null,null,null,null,null,null,null,null,null,null,null,null,null,null,null,null,null,null,null,null,null,null,null,null,null,null,null,null,null,null,null,null,null,null,null,null,null,null,null,null,"   Induced Impacts",48.663905579860803,{"$f":"C29","v":2.8143489196916627},7.9253821180437969,4.8666208820000492,null,{"$f":"ProjectData!A45","v":"Total"},{"$f":"B65","v":56.287396624428737},5628.7396624428739,1]
["  Total Impacts",{"$f":"Calculations!AH47","v":142.40276432289522},{"$f":"Calculations!AI47","v":9.3295726335091196},{"$f":"Calculations!AJ47","v":28.831041710534329},{"$f":"Calculations!AK47","v":15.497691572244637},null,null,null,null,null,null,null,null,null,null,null,null,null,null,null,null,null,null,null,null,null,null,null,null,null,null,null,null,null,null,null,null,null,null,null,null,null,null,null,null,null,null,null,null,null,null,null,null,"  Total Impacts",142.40276432289522,{"$f":"C30","v":9.3295726335091196},28.831041710534329,15.497691572244637]
[null,null,null,null,null,null,null,null,null,null,null,null,null,null,null,null,null,null,null,null,null,null,null,null,null,null,null,null,null,null,null,null,null,null,null,null,null,null,null,null,null,null,null,null,null,null,null,null,null,null,null,null,null,null,null,null,null,null,null,{"$f":"ProjectData!A47","v":"Annualized Operating and Maintenance Costs"}]
[null,null,"Annual","Annual","Annual",null,null,null,null,null,null,null,null,null,null,null,null,null,null,null,null,null,null,null,null,null,null,null,null,null,null,null,null,null,null,null,null,null,null,null,null,null,null,null,null,null,null,null,null,null,null,null,null,null,null,{"$f":"C32","v":"Annual"},"Annual","Annual",null,null,{"$f":"ProjectData!B49","v":"Cost"},{"$f":"ProjectData!C48","v":"Cost "},{"$f":"ProjectData!D48","v":"Percent of"},{"$f":"ProjectData!E48","v":"Local"}]
[null,"Annual","Earnings","Output","Output",null,null,null,null,null,null,null,null,null,null,null,null,null,null,null,null,null,null,null,null,null,null,null,null,null,null,null,null,null,null,null,null,null,null,null,null,null,null,null,null,null,null,null,null,null,null,null,null,null,{"$f":"B33","v":"Annual"},"Earnings","Output","Value Added",null,null,null,{"$f":"ProjectData!C49","v":"Per KW"},{"$f":"ProjectData!D49","v":"Total Cost"},{"$f":"ProjectData!E49","v":"Share (%)"}]
["During operating years","Jobs",{"$f":"CONCATENATE(\"$MM (\",$C10,\")\")","v":"$MM (2009)"},{"$f":"CONCATENATE(\"$MM (\",$C10,\")\")","v":"$MM (2009)"},{"$f":"CONCATENATE(\"$MM (\",$C10,\")\")","v":"$MM (2009)"},null,null,null,null,null,null,null,null,null,null,null,null,null,null,null,null,null,null,null,null,null,null,null,null,null,null,null,null,null,null,null,null,null,null,null,null,null,null,null,null,null,null,null,null,null,null,null,null,"During operating years",{"$f":"B34","v":"Jobs"},"$MM (2009)","$MM (2009)","$MM (2009)",null,{"$f":"ProjectData!A50","v":"Labor"},{"$f":"B69","v":0.76},{"$f":"BI34*10^6/(BI$7*1000)","v":76},{"$f":"IF(BI$38=0,\"na\",BI34/BI$38)","v":0.20313438605278822},{"$f":"C69","v":1}]
["   Onsite Labor Impacts",null,null,null,null,null,null,null,null,null,null,null,null,null,null,null,null,null,null,null,null,null,null,null,null,null,null,null,null,null,null,null,null,null,null,null,null,null,null,null,null,null,null,null,null,null,null,null,null,null,null,null,null,"   Onsite Labor Impacts",null,null,null,null,null,{"$f":"ProjectData!A51","v":"Materials and Services"},{"$f":"B70","v":2.8455550000000001},{"$f":"BI35*10^6/(BI$7*1000)","v":284.55549999999999},{"$f":"IF(BI$38=0,\"na\",BI35/BI$38)","v":0.76056587882163385}]
["     Hydro Project Labor Only",{"$f":"Calculations!AH51","v":9.5000000000000036},{"$f":"Calculations!AI51","v":0.70589792140927166},{"$f":"Calculations!AJ51","v":0.70589792140927166},{"$f":"Calculations!AK51","v":0.70589792140927166},null,null,null,null,null,null,null,null,null,null,null,null,null,null,null,null,null,null,null,null,null,null,null,null,null,null,null,null,null,null,null,null,null,null,null,null,null,null,null,null,null,null,null,null,null,null,null,null,"     Hydro Project Labor Only",{"$f":"B36","v":9.5000000000000036},0.70589792140927166,0.70589792140927166,0.70589792140927166,null,{"$f":"ProjectData!A52","v":"Subtotal"},{"$f":"B71","v":3.6055549999999998},{"$f":"BI36*10^6/(BI$7*1000)","v":360.55549999999999},{"$f":"IF(BI$38=0,\"na\",BI36/BI$38)","v":0.96370026487442206}]
["   Local Revenue and Supply Chain Impacts",{"$f":"Calculations!AH52","v":9.7117761729363963},{"$f":"Calculations!AI52","v":0.66566439710435221},{"$f":"Calculations!AJ52","v":2.3919073893933409},{"$f":"Calculations!AK52","v":1.3194701641672357},null,null,null,null,null,null,null,null,null,null,null,null,null,null,null,null,null,null,null,null,null,null,null,null,null,null,null,null,null,null,null,null,null,null,null,null,null,null,null,null,null,null,null,null,null,null,null,null,"   Local Revenue and Supply Chain Impacts",9.7117761729363963,0.66566439710435221,2.3919073893933409,1.3194701641672357,null,{"$f":"ProjectData!A53","v":"Sales Tax (Materials & Equipment Purchases)"},{"$f":"B72","v":0.13581057954545456},{"$f":"BI37*10^6/(BI$7*1000)","v":13.581057954545456},{"$f":"IF(BI$38=0,\"na\",BI37/BI$38)","v":3.6299735125577985E-2},{"$f":"C72","v":1}]
["   Induced Impacts",{"$f":"Calculations!AH53","v":5.8741967002838411},{"$f":"Calculations!AI53","v":0.33926860732866782},{"$f":"Calculations!AJ53","v":0.95532063396396061},{"$f":"Calculations!AK53","v":0.58663727606844451},null,null,null,null,null,null,null,null,null,null,null,null,null,null,null,null,null,null,null,null,null,null,null,null,null,null,null,null,null,null,null,null,null,null,null,null,null,null,null,null,null,null,null,null,null,null,null,null,"   Induced Impacts",5.8741967002838411,0.33926860732866782,0.95532063396396061,0.58663727606844451,null,{"$f":"ProjectData!A54","v":"Total (without property taxes and debt financing)"},{"$f":"BI37+BI36","v":3.7413655795454543},{"$f":"BI38*10^6/(BI$7*1000)","v":374.13655795454542},{"$f":"IF(BI$38=0,\"na\",BI38/BI$38)","v":1}]
["  Total Impacts",{"$f":"Calculations!AH54","v":25.085972873220243},{"$f":"Calculations!AI54","v":1.7108309258422918},{"$f":"Calculations!AJ54","v":4.0531259447665731},{"$f":"Calculations!AK54","v":2.6120053616449521},null,null,null,null,null,null,null,null,null,null,null,null,null,null,null,null,null,null,null,null,null,null,null,null,null,null,null,null,null,null,null,null,null,null,null,null,null,null,null,null,null,null,null,null,null,null,null,null,"  Total Impacts",25.085972873220243,1.7108309258422918,4.0531259447665731,2.6120053616449521]
[{"$f":"CONCATENATE(\"Notes:  Earnings and Output values are millions of dollars in year \",$C10, \" dollars.  Construction period related jobs are full time\")","v":"Notes:  Earnings and Output values are millions of dollars in year 2009 dollars.  Construction period related jobs are full time"},null,null,null,null,null,null,null,null,null,null,null,null,null,null,null,null,null,null,null,null,null,null,null,null,null,null,null,null,null,{"$f":"IF(ProjectData!B17=ProjectData!B16,\"model default\",\"User modifications to default\")","v":"model default"},null,null,null,null,null,null,null,null,null,null,null,null,null,null,null,null,null,null,null,null,null,null,{"$f":"CONCATENATE(\"Notes:  Earnings and Output values are millions of dollars in year \",$C10, \" dollars.  Construction period related jobs are full time\")","v":"Notes:  Earnings and Output values are millions of dollars in year 2009 dollars.  Construction period related jobs are full time"},null,null,null,null,null,{"$f":"ProjectData!A56","v":"Other Parameters"}]
[{"$f":"CONCATENATE(\" equivalent jobs for one year.  Based on the \",$C6,\" month construction period this is an annual average of approximately \",$Z28,\" full time\")","v":" equivalent jobs for one year.  Based on the 24 month construction period this is an annual average of approximately 71 full time"},null,null,null,null,null,null,null,null,null,null,null,null,null,null,null,null,null,null,null,null,null,null,null,null,null,null,null,null,null,null,null,null,null,null,null,null,null,null,null,null,null,null,null,null,null,null,null,null,null,null,null,null,{"$f":"CONCATENATE(\" equivalent jobs for one year.  Based on the \",$C6,\" month construction period this is an annual average of approximately \",$Z28,\" full time\")","v":" equivalent jobs for one year.  Based on the 24 month construction period this is an annual average of approximately 71 full time"},null,null,null,null,null,{"$f":"ProjectData!A57","v":"Financial Parameters"},null,null,{"$f":"ProjectData!D57","v":"Local"}]
[" equivalent jobs. Hydro project labor includes all onsite operators and technicians as well as administration and management. ",null,null,null,null,null,null,null,null,null,null,null,null,null,null,null,null,null,null,null,null,null,null,null,null,null,null,null,null,null,null,null,null,null,null,null,null,null,null,null,null,null,null,null,null,null,null,null,null,null,null,null,null," equivalent jobs. Hydro project labor includes all onsite operators and technicians as well as administration and management. ",null,null,null,null,null,{"$f":"ProjectData!A58","v":"Debt Financing"},null,null,{"$f":"ProjectData!D58","v":"Share (%)"}]
[" The analysis does not include impacts associated with plant \"profits\" and assumes no tax abatement unless noted.",null,null,null,null,null,null,null,null,null,null,null,null,null,null,null,null,null,null,null,null,null,null,null,null,null,null,null,null,null,null,null,null,null,null,null,null,null,null,null,null,null,null,null,null,null,null,null,null,null,null,null,null," The analysis does not include impacts associated with plant \"profits\" and assumes no tax abatement unless noted.",null,null,null,null,null,{"$f":"ProjectData!A59","v":"  Percentage financed"},{"$f":"ProjectData!B59","v":0.2},null,{"$f":"C84","v":0}]
[" Totals may not  add up due to independent rounding.  Due to the many uncertainties surrounding these new and emerging ",null,null,null,null,null,null,null,null,null,null,null,null,null,null,null,null,null,null,null,null,null,null,null,null,null,null,null,null,null,null,null,null,null,null,null,null,null,null,null,null,null,null,null,null,null,null,null,null,null,null,null,null," Totals may not  add up due to independent rounding.  Due to the many uncertainties surrounding these new and emerging ",null,null,null,null,null,{"$f":"ProjectData!A60","v":"  Years financed (term)"},{"$f":"ProjectData!B60","v":20}]
["  technologies all impacts should be viewed as preliminary and caution applied when reporting results.",null,null,null,null,null,null,null,null,null,null,null,null,null,null,null,null,null,null,null,null,null,null,null,null,null,null,null,null,null,null,null,null,null,null,null,null,null,null,null,null,null,null,null,null,null,null,null,null,null,null,null,null,"  technologies all impacts should be viewed as preliminary and caution applied when reporting results.",null,null,null,null,null,{"$f":"ProjectData!A61","v":"  Interest rate"},{"$f":"ProjectData!B61","v":0.1}]
[null,null,null,null,null,null,null,null,null,null,null,null,null,null,null,null,null,null,null,null,null,null,null,null,null,null,null,null,null,null,null,null,null,null,null,null,null,null,null,null,null,null,null,null,null,null,null,null,null,null,null,null,null,null,null,null,null,null,null,{"$f":"ProjectData!A68","v":"Tax Parameters"}]
["Detailed Hydro Project Data Costs",null,null,null,null,null,null,null,null,null,null,null,null,null,null,null,null,null,null,null,null,null,null,null,null,null,null,null,null,null,null,null,null,null,null,null,null,null,null,null,null,null,null,null,null,null,null,null,null,null,null,null,null,"Detailed Hydro Project Data Costs",null,null,null,null,null,{"$f":"ProjectData!A69","v":"  Local Property Tax (percent of taxable value)"},{"$f":"ProjectData!B69","v":0}]
[null,{"$f":"Calculations!AC5","v":"Cost"},"Purchased",null,null,null,null,null,null,null,null,null,null,null,null,null,null,null,null,null,null,null,null,null,null,null,null,null,null,null,null,null,null,null,null,null,null,null,null,null,null,null,null,null,null,null,null,null,null,null,null,null,null,null,null,"Local",null,null,null,{"$f":"ProjectData!A70","v":"  Assessed Value (percent of construction cost)"},{"$f":"ProjectData!B70","v":1}]
["Installation Costs",{"$f":"CONCATENATE(\"$MM (\",$C10,\")\")","v":"$MM (2009)"},"Locally (%)",null,null,null,null,null,null,null,null,null,null,null,null,null,null,null,null,null,null,null,null,null,null,null,null,null,null,null,null,null,null,null,null,null,null,null,null,null,null,null,null,null,null,null,null,null,null,null,null,null,null,"Installation Costs ","Cost","Share (%)",null,null,null,{"$f":"ProjectData!A71","v":"  Taxable Value (percent of assessed value)"},{"$f":"ProjectData!B71","v":1}]
["Materials & Equipment",null,null,null,null,null,null,null,null,null,null,null,null,null,null,null,null,null,null,null,null,null,null,null,null,null,null,null,null,null,null,null,null,null,null,null,null,null,null,null,null,null,null,null,null,null,null,null,null,null,null,null,null,"Materials & Equipment",null,null,null,null,null,{"$f":"ProjectData!A72","v":"  Taxable Value ( million$ - if applicable)"},{"$f":"ProjectData!B72","v":52.896999999999991}]
[{"$f":"Calculations!AB7","v":"  Device"},{"$f":"Calculations!AC7","v":36.292321206006285},{"$f":"Calculations!AD7","v":0.25},null,null,null,null,null,null,null,null,null,null,null,null,null,null,null,null,null,null,null,null,null,null,null,null,null,null,null,null,null,null,null,null,null,null,null,null,null,null,null,null,null,null,null,null,null,null,null,null,null,null,{"$f":"A51","v":"  Device"},36.292321206006285,0.25,null,null,null,"  Property Tax Exemption (percent of local taxes)",{"$f":"ProjectData!B73","v":1}]
[{"$f":"Calculations!AB8","v":"  Underwater Electrical Collector System"},{"$f":"Calculations!AC8","v":4.8839752903238569},{"$f":"Calculations!AD8","v":0},null,null,null,null,null,null,null,null,null,null,null,null,null,null,null,null,null,null,null,null,null,null,null,null,null,null,null,null,null,null,null,null,null,null,null,null,null,null,null,null,null,null,null,null,null,null,null,null,null,null,"  Underwater Electrical Collector System",4.8839752903238569,0,null,null,null,{"$f":"ProjectData!A74","v":"  Local Property Taxes"},{"$f":"ProjectData!B74","v":0},null,{"$f":"C93","v":1}]
[{"$f":"Calculations!AB9","v":"  Underwater Transmission Cable"},{"$f":"Calculations!AC9","v":0.7848685381921775},{"$f":"Calculations!AD9","v":0},null,null,null,null,null,null,null,null,null,null,null,null,null,null,null,null,null,null,null,null,null,null,null,null,null,null,null,null,null,null,null,null,null,null,null,null,null,null,null,null,null,null,null,null,null,null,null,null,null,null,"  Underwater Transmission Cable",0.7848685381921775,0,null,null,null,{"$f":"ProjectData!A75","v":"  Local Sales Tax Rate"},{"$f":"ProjectData!B75","v":7.4999999999999997E-2},null,{"$f":"C94","v":1}]
[{"$f":"Calculations!AB10","v":"  Cable Landing and Grid Interconnection"},{"$f":"Calculations!AC10","v":1.1511405226818603},{"$f":"Calculations!AD10","v":0},null,null,null,null,null,null,null,null,null,null,null,null,null,null,null,null,null,null,null,null,null,null,null,null,null,null,null,null,null,null,null,null,null,null,null,null,null,null,null,null,null,null,null,null,null,null,null,null,null,null,"  Cable Landing and Grid Interconnection",1.1511405226818603,0,null,null,null,{"$f":"ProjectData!A76","v":"Lease Cost (if applicable)"},{"$f":"ProjectData!B76","v":0},null,{"$f":"C95","v":1}]
[{"$f":"Calculations!AB11","v":"  Balance of Plant"},{"$f":"Calculations!AC11","v":2.0929827685124733},{"$f":"Calculations!AD11","v":0.75},null,null,null,null,null,null,null,null,null,null,null,null,null,null,null,null,null,null,null,null,null,null,null,null,null,null,null,null,null,null,null,null,null,null,null,null,null,null,null,null,null,null,null,null,null,null,null,null,null,null,"  Balance of Plant",2.0929827685124733,0.75]
[{"$f":"Calculations!AB12","v":"  Subtotal"},{"$f":"Calculations!AC12","v":45.205288325716651},null,null,null,null,null,null,null,null,null,null,null,null,null,null,null,null,null,null,null,null,null,null,null,null,null,null,null,null,null,null,null,null,null,null,null,null,null,null,null,null,null,null,null,null,null,null,null,null,null,null,null,{"$f":"A56","v":"  Subtotal"},{"$f":"B56","v":45.205288325716651}]
[{"$f":"Calculations!AB13","v":"Installation/Labor"},null,null,null,null,null,null,null,null,null,null,null,null,null,null,null,null,null,null,null,null,null,null,null,null,null,null,null,null,null,null,null,null,null,null,null,null,null,null,null,null,null,null,null,null,null,null,null,null,null,null,null,null,{"$f":"A57","v":"Installation/Labor"}]
[{"$f":"Calculations!AB14","v":"  Mooring and Device Installation"},{"$f":"Calculations!AC14","v":2.6162284606405919},{"$f":"Calculations!AD14","v":0.25},null,null,null,null,null,null,null,null,null,null,null,null,null,null,null,null,null,null,null,null,null,null,null,null,null,null,null,null,null,null,null,null,null,null,null,null,null,null,null,null,null,null,null,null,null,null,null,null,null,null,"  Mooring and Device Installation",{"$f":"B58","v":2.6162284606405919},0.25]
[{"$f":"Calculations!AB15","v":"  Underwater Cable Installation"},{"$f":"Calculations!AC15","v":2.0929827685124733},{"$f":"Calculations!AD15","v":0.25},null,null,null,null,null,null,null,null,null,null,null,null,null,null,null,null,null,null,null,null,null,null,null,null,null,null,null,null,null,null,null,null,null,null,null,null,null,null,null,null,null,null,null,null,null,null,null,null,null,null,"  Underwater Cable Installation",2.0929827685124733,0.25]
[{"$f":"Calculations!AB16","v":"  Cable Landing and Grid Connection"},{"$f":"Calculations!AC16","v":0.52324569212811833},{"$f":"Calculations!AD16","v":0.25},null,null,null,null,null,null,null,null,null,null,null,null,null,null,null,null,null,null,null,null,null,null,null,null,null,null,null,null,null,null,null,null,null,null,null,null,null,null,null,null,null,null,null,null,null,null,null,null,null,null,"  Cable Landing and Grid Connection",0.52324569212811833,0.25]
[{"$f":"Calculations!AB17","v":"  Subtotal"},{"$f":"Calculations!AC17","v":5.2324569212811838},null,null,null,null,null,null,null,null,null,null,null,null,null,null,null,null,null,null,null,null,null,null,null,null,null,null,null,null,null,null,null,null,null,null,null,null,null,null,null,null,null,null,null,null,null,null,null,null,null,null,null,"  Subtotal",5.2324569212811838,0]
[{"$f":"Calculations!AB18","v":"Permitting Cost"},{"$f":"Calculations!AC18","v":2.4592547530021567},{"$f":"Calculations!AD18","v":0.75},null,null,null,null,null,null,null,null,null,null,null,null,null,null,null,null,null,null,null,null,null,null,null,null,null,null,null,null,null,null,null,null,null,null,null,null,null,null,null,null,null,null,null,null,null,null,null,null,null,null,"Permitting Cost",{"$f":"B62","v":2.4592547530021567}]
[{"$f":"Calculations!AB19","v":"Subtotal"},{"$f":"Calculations!AC19","v":52.896999999999991},null,null,null,null,null,null,null,null,null,null,null,null,null,null,null,null,null,null,null,null,null,null,null,null,null,null,null,null,null,null,null,null,null,null,null,null,null,null,null,null,null,null,null,null,null,null,null,null,null,null,null,"Subtotal",{"$f":"B63","v":52.896999999999991}]
[{"$f":"Calculations!AB20","v":"Sales Tax (Materials & Equipment Purchases)"},{"$f":"Calculations!AC20","v":3.3903966244287487},{"$f":"Calculations!AD20","v":1},null,null,null,null,null,null,null,null,null,null,null,null,null,null,null,null,null,null,null,null,null,null,null,null,null,null,null,null,null,null,null,null,null,null,null,null,null,null,null,null,null,null,null,null,null,null,null,null,null,null,"Sales Tax (Materials & Equipment Purchases)",{"$f":"B64","v":3.3903966244287487},{"$f":"C64","v":1}]
[{"$f":"Calculations!AB21","v":"Total"},{"$f":"Calculations!AC21","v":56.287396624428737},null,null,null,null,null,null,null,null,null,null,null,null,null,null,null,null,null,null,null,null,null,null,null,null,null,null,null,null,null,null,null,null,null,null,null,null,null,null,null,null,null,null,null,null,null,null,null,null,null,null,null,"Total",{"$f":"B65","v":56.287396624428737}]
[]
[{"$f":"Calculations!AB23","v":"Annualized Operating and Maintenance Costs"},{"$f":"Calculations!AC24","v":"Cost"},"Purchased",null,null,null,null,null,null,null,null,null,null,null,null,null,null,null,null,null,null,null,null,null,null,null,null,null,null,null,null,null,null,null,null,null,null,null,null,null,null,null,null,null,null,null,null,null,null,null,null,null,null,{"$f":"A67","v":"Annualized Operating and Maintenance Costs"}]
[null,{"$f":"CONCATENATE(\"$MM (\",$C10,\")\")","v":"$MM (2009)"},"Locally (%)",null,null,null,null,null,null,null,null,null,null,null,null,null,null,null,null,null,null,null,null,null,null,null,null,null,null,null,null,null,null,null,null,null,null,null,null,null,null,null,null,null,null,null,null,null,null,null,null,null,null,null,{"$f":"B68","v":"$MM (2009)"},"Local"]
[{"$f":"Calculations!AB25","v":"Labor"},{"$f":"Calculations!AC25","v":0.76},{"$f":"Calculations!AD25","v":1},null,null,null,null,null,null,null,null,null,null,null,null,null,null,null,null,null,null,null,null,null,null,null,null,null,null,null,null,null,null,null,null,null,null,null,null,null,null,null,null,null,null,null,null,null,null,null,null,null,null,null,null,"Share (%)"]
[{"$f":"Calculations!AB26","v":"Materials and Services"},{"$f":"Calculations!AC26","v":2.8455550000000001},{"$f":"Calculations!AD26","v":0.5},null,null,null,null,null,null,null,null,null,null,null,null,null,null,null,null,null,null,null,null,null,null,null,null,null,null,null,null,null,null,null,null,null,null,null,null,null,null,null,null,null,null,null,null,null,null,null,null,null,null,{"$f":"A69","v":"Labor"},0.76,1]
[{"$f":"Calculations!AB27","v":"Subtotal"},{"$f":"Calculations!AC27","v":3.6055549999999998},null,null,null,null,null,null,null,null,null,null,null,null,null,null,null,null,null,null,null,null,null,null,null,null,null,null,null,null,null,null,null,null,null,null,null,null,null,null,null,null,null,null,null,null,null,null,null,null,null,null,null,"Materials and Services",2.8455550000000001,0.5]
[{"$f":"Calculations!AB28","v":"Sales Tax (Materials & Equipment Purchases)"},{"$f":"Calculations!AC28","v":0.13581057954545456},{"$f":"Calculations!AD28","v":1},null,null,null,null,null,null,null,null,null,null,null,null,null,null,null,null,null,null,null,null,null,null,null,null,null,null,null,null,null,null,null,null,null,null,null,null,null,null,null,null,null,null,null,null,null,null,null,null,null,null,{"$f":"A71","v":"Subtotal"},3.6055549999999998]
[{"$f":"Calculations!AB29","v":"Average Annual Debt Payment (Interest and Principal)"},{"$f":"Calculations!AC29","v":1.0314915},{"$f":"Calculations!AD29","v":0},null,null,null,null,null,null,null,null,null,null,null,null,null,null,null,null,null,null,null,null,null,null,null,null,null,null,null,null,null,null,null,null,null,null,null,null,null,null,null,null,null,null,null,null,null,null,null,null,null,null,"Sales Tax (Materials & Equipment Purchases)",0.13581057954545456,{"$f":"C72","v":1}]
[{"$f":"Calculations!AB30","v":"Equity Payment - Individuals"},{"$f":"Calculations!AC30","v":0},{"$f":"Calculations!AD30","v":0},null,null,null,null,null,null,null,null,null,null,null,null,null,null,null,null,null,null,null,null,null,null,null,null,null,null,null,null,null,null,null,null,null,null,null,null,null,null,null,null,null,null,null,null,null,null,null,null,null,null,"Average Annual Debt Payment (Interest and Principal)",1.0314915,0]
[{"$f":"Calculations!AB31","v":"Equity Payment - Corporate"},{"$f":"Calculations!AC31","v":6.9346072641296219},{"$f":"Calculations!AD31","v":0},null,null,null,null,null,null,null,null,null,null,null,null,null,null,null,null,null,null,null,null,null,null,null,null,null,null,null,null,null,null,null,null,null,null,null,null,null,null,null,null,null,null,null,null,null,null,null,null,null,null,"Equity Payment - Individuals",0,0]
[{"$f":"Calculations!AB32","v":"Property Taxes"},{"$f":"Calculations!AC32","v":0},{"$f":"Calculations!AD32","v":1},null,null,null,null,null,null,null,null,null,null,null,null,null,null,null,null,null,null,null,null,null,null,null,null,null,null,null,null,null,null,null,null,null,null,null,null,null,null,null,null,null,null,null,null,null,null,null,null,null,null,"Equity Payment - Corporate",6.9346072641296219,0]
[{"$f":"Calculations!AB33","v":"Lease Cost"},{"$f":"Calculations!AC33","v":0},{"$f":"Calculations!AD33","v":1},null,null,null,null,null,null,null,null,null,null,null,null,null,null,null,null,null,null,null,null,null,null,null,null,null,null,null,null,null,null,null,null,null,null,null,null,null,null,null,null,null,null,null,null,null,null,null,null,null,null,"Property Taxes",0,1]
[{"$f":"Calculations!AB34","v":"Total"},{"$f":"Calculations!AC34","v":11.707464343675078},null,null,null,null,null,null,null,null,null,null,null,null,null,null,null,null,null,null,null,null,null,null,null,null,null,null,null,null,null,null,null,null,null,null,null,null,null,null,null,null,null,null,null,null,null,null,null,null,null,null,null,"Lease Cost",0,1]
[null,null,null,null,null,null,null,null,null,null,null,null,null,null,null,null,null,null,null,null,null,null,null,null,null,null,null,null,null,null,null,null,null,null,null,null,null,null,null,null,null,null,null,null,null,null,null,null,null,null,null,null,null,"Total",11.707464343675078]
[{"$f":"Calculations!AB36","v":"Other Parameters"}]
[null,null,"Purchased",null,null,null,null,null,null,null,null,null,null,null,null,null,null,null,null,null,null,null,null,null,null,null,null,null,null,null,null,null,null,null,null,null,null,null,null,null,null,null,null,null,null,null,null,null,null,null,null,null,null,{"$f":"A80","v":"Other Parameters"}]
[{"$f":"Calculations!AB38","v":"Financial Parameters"},null,"Locally (%)",null,null,null,null,null,null,null,null,null,null,null,null,null,null,null,null,null,null,null,null,null,null,null,null,null,null,null,null,null,null,null,null,null,null,null,null,null,null,null,null,null,null,null,null,null,null,null,null,null,null,null,null,"Local"]
[{"$f":"Calculations!AB39","v":"Debt Financing"},null,null,null,null,null,null,null,null,null,null,null,null,null,null,null,null,null,null,null,null,null,null,null,null,null,null,null,null,null,null,null,null,null,null,null,null,null,null,null,null,null,null,null,null,null,null,null,null,null,null,null,null,{"$f":"A82","v":"Financial Parameters"},null,"Share (%)"]
[{"$f":"Calculations!AB40","v":"  Percentage financed"},{"$f":"Calculations!AC40","v":0.2},{"$f":"Calculations!AD40","v":0},null,null,null,null,null,null,null,null,null,null,null,null,null,null,null,null,null,null,null,null,null,null,null,null,null,null,null,null,null,null,null,null,null,null,null,null,null,null,null,null,null,null,null,null,null,null,null,null,null,null,"Debt Financing"]
[{"$f":"Calculations!AB41","v":"  Years financed (term)"},{"$f":"Calculations!AC41","v":20},null,null,null,null,null,null,null,null,null,null,null,null,null,null,null,null,null,null,null,null,null,null,null,null,null,null,null,null,null,null,null,null,null,null,null,null,null,null,null,null,null,null,null,null,null,null,null,null,null,null,null,"  Percentage financed",{"$f":"B84","v":0.2},{"$f":"C84","v":0}]
[{"$f":"Calculations!AB42","v":"  Interest rate"},{"$f":"Calculations!AC42","v":0.1},null,null,null,null,null,null,null,null,null,null,null,null,null,null,null,null,null,null,null,null,null,null,null,null,null,null,null,null,null,null,null,null,null,null,null,null,null,null,null,null,null,null,null,null,null,null,null,null,null,null,null,"  Years financed (term)",{"$f":"B85","v":20}]
[{"$f":"Calculations!AB43","v":"Tax Parameters"},null,null,null,null,null,null,null,null,null,null,null,null,null,null,null,null,null,null,null,null,null,null,null,null,null,null,null,null,null,null,null,null,null,null,null,null,null,null,null,null,null,null,null,null,null,null,null,null,null,null,null,null,"  Interest rate",{"$f":"B86","v":0.1}]
[{"$f":"Calculations!AB44","v":"  Local Property Tax (percent of taxable value)"},{"$f":"Calculations!AC44","v":0},null,null,null,null,null,null,null,null,null,null,null,null,null,null,null,null,null,null,null,null,null,null,null,null,null,null,null,null,null,null,null,null,null,null,null,null,null,null,null,null,null,null,null,null,null,null,null,null,null,null,null,"Tax Parameters"]
[{"$f":"Calculations!AB45","v":"  Assessed Value (percent of construction cost)"},{"$f":"Calculations!AC45","v":1},null,null,null,null,null,null,null,null,null,null,null,null,null,null,null,null,null,null,null,null,null,null,null,null,null,null,null,null,null,null,null,null,null,null,null,null,null,null,null,null,null,null,null,null,null,null,null,null,null,null,null,"  Local Property Tax (percent of taxable value)",{"$f":"B88","v":0}]
[{"$f":"Calculations!AB46","v":"  Taxable Value (percent of assessed value)"},{"$f":"Calculations!AC46","v":1},null,null,null,null,null,null,null,null,null,null,null,null,null,null,null,null,null,null,null,null,null,null,null,null,null,null,null,null,null,null,null,null,null,null,null,null,null,null,null,null,null,null,null,null,null,null,null,null,null,null,null,"  Assessed Value (percent of construction cost)",1]
[{"$f":"Calculations!AB47","v":"  Taxable Value ( million$ - if applicable)"},{"$f":"Calculations!AC47","v":52.896999999999991},null,null,null,null,null,null,null,null,null,null,null,null,null,null,null,null,null,null,null,null,null,null,null,null,null,null,null,null,null,null,null,null,null,null,null,null,null,null,null,null,null,null,null,null,null,null,null,null,null,null,null,"  Taxable Value (percent of assessed value)",1]
[{"$f":"Calculations!AB48","v":"  Property Tax Exemption (percent of local taxes)"},{"$f":"Calculations!AC48","v":1},null,null,null,null,null,null,null,null,null,null,null,null,null,null,null,null,null,null,null,null,null,null,null,null,null,null,null,null,null,null,null,null,null,null,null,null,null,null,null,null,null,null,null,null,null,null,null,null,null,null,null,"  Taxable Value ( million$ - if applicable)",52.896999999999991]
[{"$f":"Calculations!AB49","v":"  Local Property Taxes"},{"$f":"Calculations!AC49","v":0},{"$f":"Calculations!AD49","v":1},null,null,null,null,null,null,null,null,null,null,null,null,null,null,null,null,null,null,null,null,null,null,null,null,null,null,null,null,null,null,null,null,null,null,null,null,null,null,null,null,null,null,null,null,null,null,null,null,null,null,"  Property Tax Exemption (percent of local taxes)",1]
[{"$f":"Calculations!AB50","v":"  Local Sales Tax Rate"},{"$f":"Calculations!AC50","v":7.4999999999999997E-2},{"$f":"Calculations!AD50","v":1},null,null,null,null,null,null,null,null,null,null,null,null,null,null,null,null,null,null,null,null,null,null,null,null,null,null,null,null,null,null,null,null,null,null,null,null,null,null,null,null,null,null,null,null,null,null,null,null,null,null,"  Local Property Taxes",0,{"$f":"C93","v":1}]
[{"$f":"Calculations!AB51","v":"Lease Cost (if applicable)"},{"$f":"Calculations!AC51","v":0},{"$f":"Calculations!AD51","v":1},null,null,null,null,null,null,null,null,null,null,null,null,null,null,null,null,null,null,null,null,null,null,null,null,null,null,null,null,null,null,null,null,null,null,null,null,null,null,null,null,null,null,null,null,null,null,null,null,null,null,"  Local Sales Tax Rate",7.4999999999999997E-2,{"$f":"C94","v":1}]
[null,null,null,null,null,null,null,null,null,null,null,null,null,null,null,null,null,null,null,null,null,null,null,null,null,null,null,null,null,null,null,null,null,null,null,null,null,null,null,null,null,null,null,null,null,null,null,null,null,null,null,null,null,{"$f":"A95","v":"Lease Cost (if applicable)"},0,{"$f":"C95","v":1}]

{"sheet":"User Add-in Location","index":5,"n_rows":810,"n_cols":15,"rows_kept":810,"cut":false,"hidden":false,"merged":[]}
[" Multipliers For Economic Input-Output Analysis"]
[]
["MyCounty (name)",null,"Year of Data",null,{"$f":"IF(B3=\"\",\"\",IF(D3=\"\",\"     Enter Year of Data\",IF(D3>2006,IF(D3<2016,\"\",\"     ERROR - Deflators Data Not Current\"),\"     ERROR - Deflators Data Not Current\")))","v":""}]
["MyRegion (includes)",null,"Year of Data",null,{"$f":"IF(B4=\"\",\"\",IF(D4=\"\",\"     Enter Year of Data\",IF(D4>2006,IF(D4<2016,\"\",\"     ERROR - Deflators Data Not Current\"),\"     ERROR - Deflators Data Not Current\")))","v":""}]
["State (Name)"]
["Sales Tax Rate (%)",null,{"$f":"IF(B$6=\"\",\"     To incorporate Sales Tax in analysis Enter Sales Tax Rate\",\"\")","v":"     To incorporate Sales Tax in analysis Enter Sales Tax Rate"}]
["Property Tax Exemption (%)",null,{"$f":"IF(B$7=\"\",\"     To incorporate Property Tax Exemption (if applicable) in analysis Enter Percentage\",\"\")","v":"     To incorporate Property Tax Exemption (if applicable) in analysis Enter Percentage"}]
[]
["Jobs Per Million Dollars Change in Final Demand",null,null,"Personal Consumption Expenditures (PCE)"]
["  Jobs Direct Multipliers","MyCounty","MyRegion",null,{"$f":"B10","v":"MyCounty"},{"$f":"C10","v":"MyRegion"}]
["Agriculture",0,0,null,0,0]
["Mining",0,0,null,0,0]
["Construction",0,0,null,0,0]
["Manufacturing",0,0,null,0,0]
["Fabricated Metals",0,0,null,0,0]
["Machinery",0,0,null,0,0]
["Electrical Equipment",0,0,null,0,0]
["TCPU",0,0,null,0,0]
["Wholesale Trade",0,0,null,0,0]
["Retail Trade",0,0,null,0,0]
["FIRE",0,0,null,0,0]
["Misc. Services",0,0,null,0,0]
["Professional Services",0,0,null,0,0]
["Government",0,0,null,0,0]
[null,null,null,"Total",{"$f":"SUM(E11:E24)","v":0},{"$f":"SUM(F11:F24)","v":0}]
["Jobs Per Million Dollars Change in Final Demand"]
["  Jobs Indirect Multipliers",{"$f":"B10","v":"MyCounty"},{"$f":"C10","v":"MyRegion"}]
["Agriculture",0,0]
["Mining",0,0]
["Construction",0,0]
["Manufacturing",0,0]
["Fabricated Metals",0,0]
["Machinery",0,0]
["Electrical Equipment",0,0]
["TCPU",0,0]
["Wholesale Trade",0,0]
["Retail Trade",0,0]
["FIRE",0,0]
["Misc. Services",0,0]
["Professional Services",0,0]
["Government",0,0]
[]
["Jobs Per Million Dollars Change in Final Demand"]
["  Jobs Induced Multipliers",{"$f":"B27","v":"MyCounty"},{"$f":"C27","v":"MyRegion"}]
["Agriculture",0,0]
["Mining",0,0]
["Construction",0,0]
["Manufacturing",0,0]
["Fabricated Metals",0,0]
["Machinery",0,0]
["Electrical Equipment",0,0]
["TCPU",0,0]
["Wholesale Trade",0,0]
["Retail Trade",0,0]
["FIRE",0,0]
["Misc. Services",0,0]
["Professional Services",0,0]
["Government",0,0]
[]
["Earnings Per Million Dollars Change in Final Demand"]
["Earnings Direct Multipliers",{"$f":"B44","v":"MyCounty"},{"$f":"C44","v":"MyRegion"}]
["Agriculture",0,0]
["Mining",0,0]
["Construction",0,0]
["Manufacturing",0,0]
["Fabricated Metals",0,0]
["Machinery",0,0]
["Electrical Equipment",0,0]
["TCPU",0,0]
["Wholesale Trade",0,0]
["Retail Trade",0,0]
["FIRE",0,0]
["Misc. Services",0,0]
["Professional Services",0,0]
["Government",0,0]
[]
["Earnings Per Million Dollars Change in Final Demand"]
["  Earnings Indirect Multipliers",{"$f":"B61","v":"MyCounty"},{"$f":"C61","v":"MyRegion"}]
["Agriculture",8.7303593754768372E-2,0]
["Mining",4.3994605541229248E-2,0]
["Construction",7.391008734703064E-2,0]
["Manufacturing",5.0878465175628662E-2,0]
["Fabricated Metals",4.215984046459198E-2,0]
["Machinery",8.1251397728919983E-2,0]
["Electrical Equipment",0,0]
["TCPU",7.9643756151199341E-2,0]
["Wholesale Trade",4.4560521841049194E-2,0]
["Retail Trade",4.4064939022064209E-2,0]
["FIRE",6.0611814260482788E-2,0]
["Misc. Services",7.365792989730835E-2,0]
["Professional Services",5.7048916816711426E-2,0]
["Government",1.8258035182952881E-2,0]
[]
["Earnings Per Million Dollars Change in Final Demand"]
["  Earnings Induced Multipliers",{"$f":"B78","v":"MyCounty"},{"$f":"C78","v":"MyRegion"}]
["Agriculture",0,0]
["Mining",0,0]
["Construction",0,0]
["Manufacturing",0,0]
["Fabricated Metals",0,0]
["Machinery",0,0]
["Electrical Equipment",0,0]
["TCPU",0,0]
["Wholesale Trade",0,0]
["Retail Trade",0,0]
["FIRE",0,0]
["Misc. Services",0,0]
["Professional Services",0,0]
["Government",0,0]
[]
["Output Per Million Dollars Change in Final Demand"]
["  Output Direct Multipliers",{"$f":"B95","v":"MyCounty"},{"$f":"C95","v":"MyRegion"}]
["Agriculture",0,0]
["Mining",0,0]
["Construction",0,0]
["Manufacturing",0,0]
["Fabricated Metals",0,0]
["Machinery",0,0]
["Electrical Equipment",0,0]
["TCPU",0,0]
["Wholesale Trade",0,0]
["Retail Trade",0,0]
["FIRE",0,0]
["Misc. Services",0,0]
["Professional Services",0,0]
["Government",0,0]
[]
["Output Per Million Dollars Change in Final Demand"]
["  Output Indirect Multipliers",{"$f":"B112","v":"MyCounty"},{"$f":"C112","v":"MyRegion"}]
["Agriculture",0,0]
["Mining",0,0]
["Construction",0,0]
["Manufacturing",0,0]
["Fabricated Metals",0,0]
["Machinery",0,0]
["Electrical Equipment",0,0]
["TCPU",0,0]
["Wholesale Trade",0,0]
["Retail Trade",0,0]
["FIRE",0,0]
["Misc. Services",0,0]
["Professional Services",0,0]
["Government",0,0]
[]
["Output Per Million Dollars Change in Final Demand"]
["  Output Induced Multipliers",{"$f":"B129","v":"MyCounty"},{"$f":"C129","v":"MyRegion"}]
["Agriculture",0,0]
["Mining",0,0]
["Construction",0,0]
["Manufacturing",0,0]
["Fabricated Metals",0,0]
["Machinery",0,0]
["Electrical Equipment",0,0]
["TCPU",0,0]
["Wholesale Trade",0,0]
["Retail Trade",0,0]
["FIRE",0,0]
["Misc. Services",0,0]
["Professional Services",0,0]
["Government",0,0]
[]
["Value Added Per Million Dollars Change in Final Demand"]
["  Value Added Direct Multipliers","MyCounty","MyRegion"]
["Agriculture",0,0]
["Mining",0,0]
["Construction",0,0]
["Manufacturing",0,0]
["Fabricated Metals",0,0]
["Machinery",0,0]
["Electrical Equipment",0,0]
["TCPU",0,0]
["Wholesale Trade",0,0]
["Retail Trade",0,0]
["FIRE",0,0]
["Misc. Services",0,0]
["Professional Services",0,0]
["Government",0,0]
[]
["Value Added Per Million Dollars Change in Final Demand"]
["  Value Added Indirect Multipliers","MyCounty","MyRegion"]
["Agriculture",0,0]
["Mining",0,0]
["Construction",0,0]
["Manufacturing",0,0]
["Fabricated Metals",0,0]
["Machinery",0,0]
["Electrical Equipment",0,0]
["TCPU",0,0]
["Wholesale Trade",0,0]
["Retail Trade",0,0]
["FIRE",0,0]
["Misc. Services",0,0]
["Professional Services",0,0]
["Government",0,0]
[]
["Value Added Per Million Dollars Change in Final Demand"]
["  Value Added Induced Multipliers","MyCounty","MyRegion"]
["Agriculture",0,0]
["Mining",0,0]
["Construction",0,0]
["Manufacturing",0,0]
["Fabricated Metals",0,0]
["Machinery",0,0]
["Electrical Equipment",0,0]
["TCPU",0,0]
["Wholesale Trade",0,0]
["Retail Trade",0,0]
["FIRE",0,0]
["Misc. Services",0,0]
["Professional Services",0,0]
["Government",0,0]
[]
[]
[]
[]
[]
[]
[]
[]
[]
[]
[]
[]
[]
[]
[]
[]
[]
[]
[]
[]
[]
[]
[]
[]
[]
[]
[]
[]
[]
[]
[]
[]
[]
[]
[]
[]
[]
[]
[]
[]
[]
[]
[]
[]
[]
[]
[]
[]
[]
[]
[]
[]
[]
[]
[]
[]
[]
[]
[]
[]
[]
[]
[]
[]
[]
[]
[]
[]
[]
[]
[]
[]
[]
[]
[]
[]
[]
[]
[]
[]
[]
[]
[]
[]
[]
[]
[]
[]
[]
[]
[]
[]
[]
[]
[]
[]
[]
[]
[]
[]
[]
[]
[]
[]
[]
[]
[]
[]
[]
[]
[]
[]
[]
[]
[]
[]
[]
[]
[]
[]
[]
[]
[]
[]
[]
[]
[]
[]
[]
[]
[]
[]
[]
[]
[]
[]
[]
[]
[]
[]
[]
[]
[]
[]
[]
[]
[]
[]
[]
[]
[]
[]
[]
[]
[]
[]
[]
[]
[]
[]
[]
[]
[]
[]
[]
[]
[]
[]
[]
[]
[]
[]
[]
[]
[]
[]
[]
[]
[]
[]
[]
[]
[]
[]
[]
[]
[]
[]
[]
[]
[]
[]
[]
[]
[]
[]
[]
[]
[]
[]
[]
[]
[]
[]
[]
[]
[]
[]
[]
[]
[]
[]
[]
[]
[]
[]
[]
[]
[]
[]
[]
[]
[]
[]
[]
[]
[]
[]
[]
[]
[]
[]
[]
[]
[]
[]
[]
[]
[]
[]
[]
[]
[]
[]
[]
[]
[]
[]
[]
[]
[]
[]
[]
[]
[]
[]
[]
[]
[]
[]
[]
[]
[]
[]
[]
[]
[]
[]
[]
[]
[]
[]
[]
[]
[]
[]
[]
[]
[]
[]
[]
[]
[]
[]
[]
[]
[]
[]
[]
[]
[]
[]
[]
[]
[]
[]
[]
[]
[]
[]
[]
[]
[]
[]
[]
[]
[]
[]
[]
[]
[]
[]
[]
[]
[]
[]
[]
[]
[]
[]
[]
[]
[]
[]
[]
[]
[]
[]
[]
[]
[]
[]
[]
[]
[]
[]
[]
[]
[]
[]
[]
[]
[]
[]
[]
[]
[]
[]
[]
[]
[]
[]
[]
[]
[]
[]
[]
[]
[]
[]
[]
[]
[]
[]
[]
[]
[]
[]
[]
[]
[]
[]
[]
[]
[]
[]
[]
[]
[]
[]
[]
[]
[]
[]
[]
[]
[]
[]
[]
[]
[]
[]
[]
[]
[]
[]
[]
[]
[]
[]
[]
[]
[]
[]
[]
[]
[]
[]
[]
[]
[]
[]
[]
[]
[]
[]
[]
[]
[]
[]
[]
[]
[]
[]
[]
[]
[]
[]
[]
[]
[]
[]
[]
[]
[]
[]
[]
[]
[]
[]
[]
[]
[]
[]
[]
[]
[]
[]
[]
[]
[]
[]
[]
[]
[]
[]
[]
[]
[]
[]
[]
[]
[]
[]
[]
[]
[]
[]
[]
[]
[]
[]
[]
[]
[]
[]
[]
[]
[]
[]
[]
[]
[]
[]
[]
[]
[]
[]
[]
[]
[]
[]
[]
[]
[]
[]
[]
[]
[]
[]
[]
[]
[]
[]
[]
[]
[]
[]
[]
[]
[]
[]
[]
[]
[]
[]
[]
[]
[]
[]
[]
[]
[]
[]
[]
[]
[]
[]
[]
[]
[]
[]
[]
[]
[]
[]
[]
[]
[]
[]
[]
[]
[]
[]
[]
[]
[]
[]
[null,null,null,null,null,null,null,null,null,null,null,null,null,null,"Alabama"]
[null,null,null,null,null,null,null,null,null,null,null,null,null,null,"Alaska"]
[null,null,null,null,null,null,null,null,null,null,null,null,null,null,"Arizona"]
[null,null,null,null,null,null,null,null,null,null,null,null,null,null,"Arkansas"]
[null,null,null,null,null,null,null,null,null,null,null,null,null,null,"California"]
[null,null,null,null,null,null,null,null,null,null,null,null,null,null,"Colorado"]
[null,null,null,null,null,null,null,null,null,null,null,null,null,null,"Connecticut"]
[null,null,null,null,null,null,null,null,null,null,null,null,null,null,"Delaware"]
[null,null,null,null,null,null,null,null,null,null,null,null,null,null,"District of Columbia"]
[null,null,null,null,null,null,null,null,null,null,null,null,null,null,"Florida"]
[null,null,null,null,null,null,null,null,null,null,null,null,null,null,"Georgia"]
[null,null,null,null,null,null,null,null,null,null,null,null,null,null,"Hawaii"]
[null,null,null,null,null,null,null,null,null,null,null,null,null,null,"Idaho"]
[null,null,null,null,null,null,null,null,null,null,null,null,null,null,"Illinois"]
[null,null,null,null,null,null,null,null,null,null,null,null,null,null,"Indiana"]
[null,null,null,null,null,null,null,null,null,null,null,null,null,null,"Iowa"]
[null,null,null,null,null,null,null,null,null,null,null,null,null,null,"Kansas"]
[null,null,null,null,null,null,null,null,null,null,null,null,null,null,"Kentucky"]
[null,null,null,null,null,null,null,null,null,null,null,null,null,null,"Louisiana"]
[null,null,null,null,null,null,null,null,null,null,null,null,null,null,"Maine"]
[null,null,null,null,null,null,null,null,null,null,null,null,null,null,"Maryland"]
[null,null,null,null,null,null,null,null,null,null,null,null,null,null,"Massachusetts"]
[null,null,null,null,null,null,null,null,null,null,null,null,null,null,"Michigan"]
[null,null,null,null,null,null,null,null,null,null,null,null,null,null,"Minnesota"]
[null,null,null,null,null,null,null,null,null,null,null,null,null,null,"Mississippi"]
[null,null,null,null,null,null,null,null,null,null,null,null,null,null,"Missouri"]
[null,null,null,null,null,null,null,null,null,null,null,null,null,null,"Montana"]
[null,null,null,null,null,null,null,null,null,null,null,null,null,null,"Nebraska"]
[null,null,null,null,null,null,null,null,null,null,null,null,null,null,"Nevada"]
[null,null,null,null,null,null,null,null,null,null,null,null,null,null,"New Hampshire"]
[null,null,null,null,null,null,null,null,null,null,null,null,null,null,"New Jersey"]
[null,null,null,null,null,null,null,null,null,null,null,null,null,null,"New Mexico"]
[null,null,null,null,null,null,null,null,null,null,null,null,null,null,"New York"]
[null,null,null,null,null,null,null,null,null,null,null,null,null,null,"North Carolina"]
[null,null,null,null,null,null,null,null,null,null,null,null,null,null,"North Dakota"]
[null,null,null,null,null,null,null,null,null,null,null,null,null,null,"Ohio"]
[null,null,null,null,null,null,null,null,null,null,null,null,null,null,"Oklahoma"]
[null,null,null,null,null,null,null,null,null,null,null,null,null,null,"Oregon"]
[null,null,null,null,null,null,null,null,null,null,null,null,null,null,"Pennsylvania"]
[null,null,null,null,null,null,null,null,null,null,null,null,null,null,"Rhode Island"]
[null,null,null,null,null,null,null,null,null,null,null,null,null,null,"South Carolina"]
[null,null,null,null,null,null,null,null,null,null,null,null,null,null,"South Dakota"]
[null,null,null,null,null,null,null,null,null,null,null,null,null,null,"Tennessee"]
[null,null,null,null,null,null,null,null,null,null,null,null,null,null,"Texas"]
[null,null,null,null,null,null,null,null,null,null,null,null,null,null,"Utah"]
[null,null,null,null,null,null,null,null,null,null,null,null,null,null,"Vermont"]
[null,null,null,null,null,null,null,null,null,null,null,null,null,null,"Virginia"]
[null,null,null,null,null,null,null,null,null,null,null,null,null,null,"Washington"]
[null,null,null,null,null,null,null,null,null,null,null,null,null,null,"West Virginia"]
[null,null,null,null,null,null,null,null,null,null,null,null,null,null,"Wisconsin"]
[null,null,null,null,null,null,null,null,null,null,null,null,null,null,"Wyoming"]

{"sheet":"DefaultData","index":6,"n_rows":104,"n_cols":94,"rows_kept":104,"cut":false,"hidden":false,"merged":[]}
[null,null,null,"System Type"]
[null,null,null,{"$f":"ProjectData!B15","v":"Wave Power"},null,null,null,null,null,null,null,null,null,null,1,2,3,4,5,6]
[null,null,null,null,null,null,null,null,null,null,null,null,null,null,1,2,3,4,5,6]
[null,null,null,null,"KW","Total KW Installed"]
["Warning",null,null,null,{"$f":"ProjectData!B17*1000","v":10000},{"$f":"E5","v":10000}]
[]
["This Worksheet contains Data and Formulas that are an integral part of the JEDI model.  ",null,null,"Construction","Project Cost","O&M","O&M Cost"]
[null,null,null,"Cost Per KW","MM$","Cost Per KW","MM$",null,null,null,null,null,null,null,null,null,null,null,null,null,null,null,null,null,null,null,null,null,null,null,null,null,null,null,null,null,"Wave Power","Tidal Power","Ocean Current","River Current"]
["Although the data and formulas are available for review they must not be changed.",null,null,{"$f":"IF(ProjectData!B17=ProjectData!B16,ProjectData!B19,0)","v":5289.7},{"$f":"+D9*F5/10^6","v":52.896999999999998},{"$f":"ProjectData!B20*D9","v":360.55549999999999},{"$f":"F9*F5/10^6","v":3.6055549999999998},null,null,null,null,null,null,null,null,null,null,null,null,null,null,null,null,null,null,null,null,null,null,null,null,null,null,null,null,null,1,2,3,4]
[]
["Any changes to the data or formulas will impact the analysis and may invalidate the model results.",null,"Project Data","Default Values - Based on Cost Per KW from Project Data sheet",null,null,null,null,null,null,null,null,null,null,null,null,null,null,null,null,null,null,null,null,null,null,null,null,null,null,null,null,null,null,{"$f":"ProjectData!B15","v":"Wave Power"},null,"Wave Power","Tidal Power","Ocean Current","River Current",null,null,null,null,null,null,null,"Scale",1,null,null,null,null,{"$f":"AW11","v":1},null,null,null,{"$f":"AW11","v":1},null,null,null,{"$f":"AW11","v":1}]
[null,null,null,null,null,null,null,"Very Small","Small","Medium","Large",null,null,null,null,null,null,null,null,null,null,null,null,null,null,null,null,null,null,null,null,null,null,null,{"$f":"IF(AI11=\"Wave Power\",1,IF(AI11=\"Tidal Power\",2,IF(AI11=\"Ocean Current\",3,IF(AI11=\"River Current\",4,\"Error\"))))","v":1},null,1,2,3,4]
[null,null,null,null,null,null,null,30000,100000,300000,400000,null,{"$f":"ProjectData!B13","v":0},null,null,null,null,null,null,null,null,null,null,null,null,null,null,null,null,null,null,null,null,null,{"$f":"HLOOKUP(AI$12,AK$12:AP$47,AJ13)","v":5289.7},2,5289.7,4566.7,6776.7,3897.94,null,null,null,null,null,null,null,5289.7,1,null,null,null,4566.7,1,null,null,6776.7,1,null,null,3897.94,1]
[null,null,"Installed Capital Costs","Cost","Cost ","Percent","State","County","County","County","County",null,null,null,30000,null,null,null,null,null,null,null,null,null,null,null,null,null,null,null,null,null,null,null,{"$f":"HLOOKUP(AI$12,AK$12:AP$47,AJ14)","v":24},{"$f":"AJ13+1","v":3},24,24,24,12,null,null,null,null,"Installation Costs",null,null,"Wave Power","Scale","Scaled Cost Share","Adj. Scaled Cost",null,"Tidal Power","Scale","Scaled Cost Share","Adj. Scaled Cost","Ocean Current","Scale","Scaled Cost Share","Adj. Scaled Cost","River Current","Scale","Scaled Cost Share","Adj. Scaled Cost"]
[null,null,"Tidal Power",null,"Per KW","of Cost","Local Share","Local Share","Local Share","Local Share","Local Share",null,null,null,100000,null,null,300000,null,null,400000,null,null,null,null,null,null,null,null,null,null,null,null,null,{"$f":"HLOOKUP(AI$12,AK$12:AP$47,AJ15)","v":10},4,10,10,10,5,null,null,null,null,"Materials & Equipment"]
[null,null,"  Device",{"$f":"(E$9-D$27)*F16","v":36.292321206006285},{"$f":"D16/F$5","v":3.6292321206006285E-3},{"$f":"AI16+AI17+AI19","v":0.76141128943728453},{"$f":"IF(ProjectData!$B$12=\"United States\",1,0.25)","v":0.25},0,0,0.25,{"$f":"G16","v":0.25},null,{"$f":"(M$13-H$13)/(I$13-H$13)","v":-0.42857142857142855},{"$f":"+I16-H16","v":0},{"$f":"H16+(N16*M16)","v":0},{"$f":"(M$13-I$13)/(J$13-I$13)","v":-0.5},{"$f":"J16-I16","v":0.25},{"$f":"I16+(P16*Q16)","v":-0.125},{"$f":"IF((M$13-J$13)/(K$13-J$13)>1,1,(M$13-J$13)/(K$13-J$13))","v":-3},{"$f":"K16-J16","v":0},{"$f":"J16+(S16*T16)","v":0.25},null,null,null,null,null,null,null,null,null,null,null,null,"structural",{"$f":"HLOOKUP(AI$12,AK$12:AP$48,AJ16)","v":0.30232507080598064},5,{"$f":"AY16","v":0.30232507080598064},{"$f":"BD16","v":0.29159766721866226},{"$f":"BH16","v":0.22597504045232208},{"$f":"BL16","v":0.22666673966722695},null,null,null,{"$f":"(AV16+AV19)/(AV16+AV17+AV19)","v":0.47058823529411764},"  Structural ",null,null,0.27241972817377885,1,{"$f":"AV16*AW$13^AW16","v":0.27241972817377885},{"$f":"AX16/AX$37","v":0.30232507080598064},null,0.26605645214268508,{"$f":"BB$11","v":1},{"$f":"BA16*BB$13^BB16","v":0.26605645214268508},{"$f":"BC16/BC$37","v":0.29159766721866226},0.17929080525919697,{"$f":"BF$11","v":1},{"$f":"BE16*BF$13^BF16","v":0.17929080525919697},{"$f":"BG16/BG$37","v":0.22597504045232208},0.21241989358481658,{"$f":"BJ$11","v":1},{"$f":"BI16*BJ$13^BJ16","v":0.21241989358481658},{"$f":"BK16/BK$37","v":0.22666673966722695}]
[null,null,"  Underwater Electrical Collector System",{"$f":"(E$9-D$27)*F17","v":4.8839752903238569},{"$f":"D17/F$5","v":4.8839752903238572E-4},{"$f":"AI18","v":0.10246558500010977},{"$f":"IF(ProjectData!$B$12=\"United States\",1,0)","v":0},0,0,0,0,null,{"$f":"(M$13-H$13)/(I$13-H$13)","v":-0.42857142857142855},{"$f":"+I17-H17","v":0},{"$f":"H17+(N17*M17)","v":0},{"$f":"(M$13-I$13)/(J$13-I$13)","v":-0.5},{"$f":"J17-I17","v":0},{"$f":"I17+(P17*Q17)","v":0},{"$f":"IF((M$13-J$13)/(K$13-J$13)>1,1,(M$13-J$13)/(K$13-J$13))","v":-3},{"$f":"K17-J17","v":0},{"$f":"J17+(S17*T17)","v":0},null,null,null,null,null,null,null,null,null,null,null,null,"power take off",0.40310009440797417,6,{"$f":"AY17","v":0.40310009440797417},{"$f":"BD17","v":0.3239974080207359},{"$f":"BH17","v":0.25108337828035787},{"$f":"BL17","v":0.62962983240896375},null,null,null,null,"  Power Take Off ",null,null,0.36322630423170515,1,{"$f":"AV17*AW$13^AW17","v":0.36322630423170515},{"$f":"AX17/AX$37","v":0.40310009440797417},null,0.29561828015853903,1,0.29561828015853903,{"$f":"BC17/BC$37","v":0.3239974080207359},0.19921200584355217,1,0.19921200584355217,{"$f":"BG17/BG$37","v":0.25108337828035787},0.59005525995782382,{"$f":"BJ$11","v":1},0.59005525995782382,{"$f":"BK17/BK$37","v":0.62962983240896375}]
["To view the data and formulas simply scroll over to the adjacent columns to the right.",null,"  Underwater Transmission Cable",{"$f":"(E$9-D$27)*F18","v":0.7848685381921775},{"$f":"D18/F$5","v":7.8486853819217754E-5},{"$f":"AI20","v":1.6466507124508749E-2},{"$f":"IF(ProjectData!$B$12=\"United States\",1,0)","v":0},0,0,0,0,null,{"$f":"(M$13-H$13)/(I$13-H$13)","v":-0.42857142857142855},{"$f":"+I18-H18","v":0},{"$f":"H18+(N18*M18)","v":0},{"$f":"(M$13-I$13)/(J$13-I$13)","v":-0.5},{"$f":"J18-I18","v":0},{"$f":"I18+(P18*Q18)","v":0},{"$f":"IF((M$13-J$13)/(K$13-J$13)>1,1,(M$13-J$13)/(K$13-J$13))","v":-3},{"$f":"K18-J18","v":0},{"$f":"J18+(S18*T18)","v":0},null,null,null,null,null,null,null,null,null,null,null,null,"Underwater Electrical Collector System",0.10246558500010977,7,0.10246558500010977,0.11200710394316846,0.12399799133297379,2.3800007665058829E-2,null,null,null,null,"  Electrical Collector System",null,null,9.2329910776109358E-2,1,9.2329910776109358E-2,0.10246558500010977,null,0.10219633433332603,1,0.10219633433332603,0.11200710394316846,9.8381217996960188E-2,1,9.8381217996960188E-2,0.12399799133297379,2.2304088826405742E-2,1,2.2304088826405742E-2,2.3800007665058829E-2]
[null,null,"  Cable Landing and Grid Interconnection",{"$f":"(E$9-D$27)*F19","v":1.1511405226818603},{"$f":"D19/F$5","v":1.1511405226818603E-4},{"$f":"AI21","v":2.4150877115946164E-2},{"$f":"IF(ProjectData!$B$12=\"United States\",1,0)","v":0},0,0,0,0,null,{"$f":"(M$13-H$13)/(I$13-H$13)","v":-0.42857142857142855},{"$f":"+I19-H19","v":0},{"$f":"H19+(N19*M19)","v":0},{"$f":"(M$13-I$13)/(J$13-I$13)","v":-0.5},{"$f":"J19-I19","v":0},{"$f":"I19+(P19*Q19)","v":0},{"$f":"IF((M$13-J$13)/(K$13-J$13)>1,1,(M$13-J$13)/(K$13-J$13))","v":-3},{"$f":"K19-J19","v":0},{"$f":"J19+(S19*T19)","v":0},null,null,null,null,"Default",null,null,null,null,null,null,null,"foundation",5.5986124223329749E-2,8,5.5986124223329749E-2,0.12959896320829434,0.18598768761507992,2.7375210104737552E-2,null,null,null,null,"  Foundation ",null,null,5.0448097809959049E-2,1,5.0448097809959049E-2,5.5986124223329749E-2,null,0.1182473120634156,1,0.1182473120634156,0.12959896320829434,0.14756444877300162,1,0.14756444877300162,0.18598768761507992,2.5654576519905384E-2,1,2.5654576519905384E-2,2.7375210104737552E-2]
[null,null,"  Balance of Plant",{"$f":"(E$9-D$27)*F20","v":2.0929827685124733},{"$f":"D20/F$5","v":2.0929827685124735E-4},{"$f":"AI22","v":4.3910685665356664E-2},{"$f":"IF(ProjectData!$B$12=\"United States\",1,0.75)","v":0.75},0,0,0.75,0.75,null,{"$f":"(M$13-H$13)/(I$13-H$13)","v":-0.42857142857142855},{"$f":"+I20-H20","v":0},{"$f":"H20+(N20*M20)","v":0},{"$f":"(M$13-I$13)/(J$13-I$13)","v":-0.5},{"$f":"J20-I20","v":0.75},{"$f":"I20+(P20*Q20)","v":-0.375},{"$f":"IF((M$13-J$13)/(K$13-J$13)>1,1,(M$13-J$13)/(K$13-J$13))","v":-3},{"$f":"K20-J20","v":0},{"$f":"J20+(S20*T20)","v":0.75},null,null,null,null,"  Construction and Installation Labor","Day Rate","Crew","Wage per hour",null,null,null,null,"Underwater Transmission Cable",1.6466507124508749E-2,9,1.6466507124508749E-2,1.1999904000767996E-2,0.11159261256904794,1.3687605052368776E-2,null,null,null,null,"  Sea Cable",null,null,1.4837675826458544E-2,1,1.4837675826458544E-2,1.6466507124508749E-2,null,1.0948825191057001E-2,1,1.0948825191057001E-2,1.1999904000767996E-2,8.8538669263800968E-2,1,8.8538669263800968E-2,0.11159261256904794,1.2827288259952692E-2,1,1.2827288259952692E-2,1.3687605052368776E-2]
[null,null,"  Subtotal",{"$f":"SUM(D16:D20)","v":45.205288325716651},{"$f":"SUM(E16:E20)","v":4.5205288325716655E-3},{"$f":"SUM(F16:F20)","v":0.94840494434320588},null,null,null,null,null,null,null,null,null,null,null,null,null,null,null,null,null,null,null,"  Vessel",{"$f":"D102","v":10000},{"$f":"F102","v":4},{"$f":"G102","v":64.219119251483306},null,null,null,null,"Cable Landing and Grid Interconnection",2.4150877115946164E-2,10,2.4150877115946164E-2,2.6399788801689587E-2,2.0458645637658788E-2,2.7375210104737557E-3,null,null,null,null,"  Sea Cable Landing and Grid Interconnection",null,null,2.176192454547253E-2,1,2.176192454547253E-2,2.4150877115946164E-2,null,2.40874154203254E-2,1,2.40874154203254E-2,2.6399788801689587E-2,1.6232089365030178E-2,1,1.6232089365030178E-2,2.0458645637658788E-2,2.5654576519905385E-3,1,2.5654576519905385E-3,2.7375210104737557E-3]
[null,null,"Installation/Labor",null,null,null,null,null,null,null,null,null,null,null,null,null,null,null,null,null,null,null,null,null,null,"  Fuel",{"$f":"E102","v":3500},null,null,null,null,null,null,"Vessels and Equip",4.3910685665356664E-2,11,4.3910685665356664E-2,4.7999616003071982E-2,3.719753752301598E-2,1.3687605052368776E-2,null,null,null,null,"  Vessels and Equipment",null,null,3.9567135537222783E-2,1,3.9567135537222783E-2,4.3910685665356664E-2,null,4.3795300764228003E-2,1,4.3795300764228003E-2,4.7999616003071982E-2,2.9512889754600324E-2,1,2.9512889754600324E-2,3.719753752301598E-2,1.2827288259952692E-2,1,1.2827288259952692E-2,1.3687605052368776E-2]
[null,null,"  Mooring and Device Installation",{"$f":"E$9*F23","v":2.6162284606405919},{"$f":"D23/F$5","v":2.6162284606405918E-4},{"$f":"AI25","v":4.9458919421528483E-2},{"$f":"IF(ProjectData!$B$12=\"United States\",1,0.25)","v":0.25},0.25,0.25,0.25,{"$f":"G23","v":0.25},null,{"$f":"(M$13-H$13)/(I$13-H$13)","v":-0.42857142857142855},{"$f":"+I23-H23","v":0},{"$f":"H23+(N23*M23)","v":0.25},{"$f":"(M$13-I$13)/(J$13-I$13)","v":-0.5},{"$f":"J23-I23","v":0},{"$f":"I23+(P23*Q23)","v":0.25},{"$f":"IF((M$13-J$13)/(K$13-J$13)>1,1,(M$13-J$13)/(K$13-J$13))","v":-3},{"$f":"K23-J23","v":0},{"$f":"J23+(S23*T23)","v":0.25},null,null,null,null,"  Other",null,null,null,null,null,null,null,null,0.94840494434320588,12,{"$f":"AY23","v":0.94840494434320588},0.94360045119639058,0.95629289341045631,0.93758452096119838,null,null,null,null,"   Subtotal",null,null,0.85459077690070628,null,{"$f":"SUM(AX16:AX22)","v":0.85459077690070628},{"$f":"SUM(AY16:AY22)","v":0.94840494434320588},null,0.86094992007357618,null,{"$f":"SUM(BC16:BC22)","v":0.86094992007357618},{"$f":"SUM(BD16:BD22)","v":0.94360045119639058},0.75873212625614239,null,{"$f":"SUM(BG16:BG22)","v":0.75873212625614239},{"$f":"SUM(BH16:BH22)","v":0.95629289341045631},0.87865385306084764,null,{"$f":"SUM(BK16:BK22)","v":0.87865385306084764},{"$f":"SUM(BL16:BL22)","v":0.93758452096119838}]
[null,null,"  Underwater Cable Installation",{"$f":"E$9*F24","v":2.0929827685124733},{"$f":"D24/F$5","v":2.0929827685124735E-4},{"$f":"AI26","v":3.9567135537222783E-2},{"$f":"IF(ProjectData!$B$12=\"United States\",1,0.25)","v":0.25},0.25,0.25,0.25,0.25,null,{"$f":"(M$13-H$13)/(I$13-H$13)","v":-0.42857142857142855},{"$f":"+I24-H24","v":0},{"$f":"H24+(N24*M24)","v":0.25},{"$f":"(M$13-I$13)/(J$13-I$13)","v":-0.5},{"$f":"J24-I24","v":0},{"$f":"I24+(P24*Q24)","v":0.25},{"$f":"IF((M$13-J$13)/(K$13-J$13)>1,1,(M$13-J$13)/(K$13-J$13))","v":-3},{"$f":"K24-J24","v":0},{"$f":"J24+(S24*T24)","v":0.25},null,null,null,null,null,"Percentage","Cost",null,null,null,null,null,null,null,13,null,null,null,null,null,null,null,null,"Installation/Labor"]
[null,null,"  Cable Landing and Grid Connection",{"$f":"E$9*F25","v":0.52324569212811833},{"$f":"D25/F$5","v":5.2324569212811836E-5},{"$f":"AI27","v":9.8917838843056959E-3},{"$f":"IF(ProjectData!$B$12=\"United States\",1,0.25)","v":0.25},0.25,0.25,0.25,0.25,null,{"$f":"(M$13-H$13)/(I$13-H$13)","v":-0.42857142857142855},{"$f":"+I25-H25","v":0},{"$f":"H25+(N25*M25)","v":0.25},{"$f":"(M$13-I$13)/(J$13-I$13)","v":-0.5},{"$f":"J25-I25","v":0},{"$f":"I25+(P25*Q25)","v":0.25},{"$f":"IF((M$13-J$13)/(K$13-J$13)>1,1,(M$13-J$13)/(K$13-J$13))","v":-3},{"$f":"K25-J25","v":0},{"$f":"J25+(S25*T25)","v":0.25},null,null,null,null,"Labor",{"$f":"AB25/AA$21","v":0.32000000000000017},{"$f":"AB21*Z30*10","v":3200.0000000000018},null,null,null,null,null,"  Mooring and Device Installation",4.9458919421528483E-2,14,{"$f":"AX25","v":4.9458919421528483E-2},{"$f":"BC25","v":5.4744125955285002E-2},{"$f":"BG25","v":3.6891112193250405E-2},{"$f":"BK25","v":4.3612780083839155E-2},null,null,null,null,"  Mooring and Devices",null,null,4.9458919421528483E-2,1,{"$f":"AV25*AW$13^AW25","v":4.9458919421528483E-2},null,null,5.4744125955285002E-2,{"$f":"BB$11","v":1},{"$f":"BA25*BB$13^BB25","v":5.4744125955285002E-2},null,3.6891112193250405E-2,{"$f":"BF$11","v":1},{"$f":"BE25*BF$13^BF25","v":3.6891112193250405E-2},null,4.3612780083839155E-2,{"$f":"BJ$11","v":1},{"$f":"BI25*BJ$13^BJ25","v":4.3612780083839155E-2}]
[null,null,"  Other Costs",{"$f":"E$9*F26","v":0},{"$f":"D26/F$5","v":0},{"$f":"AI28","v":0},null,null,null,null,null,null,null,null,null,null,null,null,null,null,null,null,null,null,null,"Fuel",{"$f":"AB26/AA$21","v":0.35},{"$f":"AA22","v":3500},null,null,null,null,null,"  Underwater Cable Installation",3.9567135537222783E-2,15,3.9567135537222783E-2,2.1897650382114001E-2,0.16232089365030178,6.4136441299763461E-3,null,null,null,null,"  Sea Cable",null,null,3.9567135537222783E-2,1,{"$f":"AV26*AW$13^AW26","v":3.9567135537222783E-2},null,null,2.1897650382114001E-2,{"$f":"BB$11","v":1},{"$f":"BA26*BB$13^BB26","v":2.1897650382114001E-2},null,0.16232089365030178,{"$f":"BF$11","v":1},{"$f":"BE26*BF$13^BF26","v":0.16232089365030178},null,6.4136441299763461E-3,{"$f":"BJ$11","v":1},{"$f":"BI26*BJ$13^BJ26","v":6.4136441299763461E-3}]
[null,null,"  Subtotal",{"$f":"SUM(D23:D26)","v":5.2324569212811838},{"$f":"SUM(E23:E26)","v":5.2324569212811836E-4},{"$f":"SUM(F23:F26)","v":9.8917838843056966E-2},null,null,null,null,null,null,null,null,null,null,null,null,null,null,null,null,null,null,null,"Other",{"$f":"1-(AA26+AA25)","v":0.32999999999999985},{"$f":"AA21-(AB25+AB26)","v":3299.9999999999982},null,null,null,null,null,"  Cable Landing and Grid Connection",9.8917838843056959E-3,16,9.8917838843056959E-3,1.0948825191057001E-2,7.3782224386500809E-3,1.2827288259952692E-2,null,null,null,null,"  Sea Cable Landing and Grid Interconnection",null,null,9.8917838843056959E-3,1,{"$f":"AV27*AW$13^AW27","v":9.8917838843056959E-3},null,null,1.0948825191057001E-2,{"$f":"BB$11","v":1},{"$f":"BA27*BB$13^BB27","v":1.0948825191057001E-2},null,7.3782224386500809E-3,{"$f":"BF$11","v":1},{"$f":"BE27*BF$13^BF27","v":7.3782224386500809E-3},null,1.2827288259952692E-2,{"$f":"BJ$11","v":1},{"$f":"BI27*BJ$13^BJ27","v":1.2827288259952692E-2}]
[null,null,"Permitting Cost",{"$f":"(E$9-D$27)*F28","v":2.4592547530021567},{"$f":"D28/F$5","v":2.4592547530021566E-4},{"$f":"AI31+AI32+AI33+AI34","v":5.1595055656794085E-2},{"$f":"IF(ProjectData!$B$12=\"United States\",1,0.75)","v":0.75},0.75,0.75,0.75,0.75,null,{"$f":"(M$13-H$13)/(I$13-H$13)","v":-0.42857142857142855},{"$f":"+I28-H28","v":0},{"$f":"H28+(N28*M28)","v":0.75},{"$f":"(M$13-I$13)/(J$13-I$13)","v":-0.5},{"$f":"J28-I28","v":0},{"$f":"I28+(P28*Q28)","v":0.75},{"$f":"IF((M$13-J$13)/(K$13-J$13)>1,1,(M$13-J$13)/(K$13-J$13))","v":-3},{"$f":"K28-J28","v":0},{"$f":"J28+(S28*T28)","v":0.75},null,null,null,null,"Total",null,{"$f":"SUM(AB25:AB27)","v":10000},null,null,null,null,null,"  Other Costs",{"$f":"HLOOKUP(AI$12,AK$12:AP$48,AJ28)","v":0},17,0,0,0,0,null,null,null,null,"  Other Costs"]
[null,null,null,null,null,null,null,null,null,null,null,null,null,null,null,null,null,null,null,null,null,null,null,null,null,"Employer Cost","Wage per hour","Employer Ben Costs",null,"Earnings per year (incl empl costs)",null,null,null,null,9.8917838843056966E-2,{"$f":"AJ28+1","v":18},9.8917838843056966E-2,8.7590601528456005E-2,0.20659022828220228,6.2853712473768197E-2,null,null,null,null,"  Subtotal",null,null,9.8917838843056966E-2,null,{"$f":"SUM(AX25:AX27)","v":9.8917838843056966E-2},null,null,8.7590601528456005E-2,null,{"$f":"SUM(BC25:BC27)","v":8.7590601528456005E-2},null,0.20659022828220228,null,{"$f":"SUM(BG25:BG27)","v":0.20659022828220228},null,6.2853712473768197E-2,null,{"$f":"SUM(BK25:BK27)","v":6.2853712473768197E-2}]
[null,null,"Subtotal",{"$f":"D28+D27+D21","v":52.896999999999991},{"$f":"E28+E27+E21","v":5.2896999999999996E-3},{"$f":"F28+F27+F21","v":1.0989178388430569},null,"Very Small","Small","Medium","Large",null,null,null,null,null,null,null,null,null,null,null,null,null,null,{"$f":"AA30+AB30","v":80.000000000000043},{"$f":"AC21","v":64.219119251483306},{"$f":"AA30*Calculations!K29","v":15.780880748516738},null,{"$f":"Z30*40*52","v":166400.00000000009},null,null,null,null,0,19,0,0,0,0,null,null,null,null,"Other Costs"]
[null,null,"Sales Tax (Materials & Equipment Purchases)",{"$f":"D21*D61","v":3.3903966244287487},{"$f":"D31/F$5","v":3.3903966244287488E-4},null,1,30000,100000,300000,400000,null,null,null,null,null,null,null,null,null,null,null,null,null,null,null,null,null,null,null,null,null,null,"  Environmental Analysis/Permiting",6.5866028498035006E-3,20,{"$f":"AY31","v":6.5866028498035006E-3},{"$f":"BD31","v":7.1999424004607964E-3},{"$f":"BH31","v":5.5796306284523964E-3},{"$f":"BL31","v":1.6425126062842535E-2},null,null,null,null,"  Environmental Analysis/Permiting",null,null,5.935070330583418E-3,1,{"$f":"AV31*AW$13^AW31","v":5.935070330583418E-3},{"$f":"AX31/AX$37","v":6.5866028498035006E-3},null,6.5692951146341999E-3,{"$f":"BB$11","v":1},{"$f":"BA31*BB$13^BB31","v":6.5692951146341999E-3},{"$f":"BC31/BC$37","v":7.1999424004607964E-3},4.426933463190048E-3,{"$f":"BF$11","v":1},{"$f":"BE31*BF$13^BF31","v":4.426933463190048E-3},{"$f":"BG31/BG$37","v":5.5796306284523964E-3},1.5392745911943232E-2,{"$f":"BJ$11","v":1},{"$f":"BI31*BJ$13^BJ31","v":1.5392745911943232E-2},{"$f":"BK31/BK$37","v":1.6425126062842535E-2}]
[null,null,"Total",{"$f":"D31+D30","v":56.287396624428737},null,null,null,"County","County","County","County",null,null,null,null,null,null,null,null,null,null,null,null,null,null,"User Defined",null,null,null,"Calculations",null,null,null,"  Engineering and Design",3.0737479965749666E-2,21,3.0737479965749666E-2,3.3599731202150387E-2,2.6038276266111184E-2,2.1900168083790045E-2,null,null,null,null,"  Engineering and Design",null,null,2.7696994876055949E-2,1,{"$f":"AV32*AW$13^AW32","v":2.7696994876055949E-2},{"$f":"AX32/AX$37","v":3.0737479965749666E-2},null,3.0656710534959601E-2,{"$f":"BB$11","v":1},{"$f":"BA32*BB$13^BB32","v":3.0656710534959601E-2},{"$f":"BC32/BC$37","v":3.3599731202150387E-2},2.0659022828220224E-2,{"$f":"BF$11","v":1},{"$f":"BE32*BF$13^BF32","v":2.0659022828220224E-2},{"$f":"BG32/BG$37","v":2.6038276266111184E-2},2.0523661215924308E-2,{"$f":"BJ$11","v":1},{"$f":"BI32*BJ$13^BJ32","v":2.0523661215924308E-2},{"$f":"BK32/BK$37","v":2.1900168083790045E-2}]
[null,null,"Annualized Operating and Maintenance Costs","Cost","Cost ","Percent","Local Share","Local Share","Local Share","Local Share","Local Share",null,null,null,null,null,null,null,null,null,null,null,null,null,null,"  Construction and Installation Labor","Day Rate","Crew","Wage per hour",null,null,null,null,"  Other Costs",6.5866028498035006E-3,22,6.5866028498035006E-3,7.1999424004607964E-3,5.5796306284523964E-3,1.3687605052368776E-2,null,null,null,null,"  Other Costs",null,null,5.935070330583418E-3,1,{"$f":"AV33*AW$13^AW33","v":5.935070330583418E-3},{"$f":"AX33/AX$37","v":6.5866028498035006E-3},null,6.5692951146341999E-3,{"$f":"BB$11","v":1},{"$f":"BA33*BB$13^BB33","v":6.5692951146341999E-3},{"$f":"BC33/BC$37","v":7.1999424004607964E-3},4.426933463190048E-3,{"$f":"BF$11","v":1},{"$f":"BE33*BF$13^BF33","v":4.426933463190048E-3},{"$f":"BG33/BG$37","v":5.5796306284523964E-3},1.2827288259952692E-2,{"$f":"BJ$11","v":1},{"$f":"BI33*BJ$13^BJ33","v":1.2827288259952692E-2},{"$f":"BK33/BK$37","v":1.3687605052368776E-2}]
[null,null,null,null,"Per KW","of Cost",null,null,null,null,null,null,null,null,null,null,null,null,null,null,null,null,null,null,null,"  Vessel",{"$f":"AA21","v":10000},{"$f":"AB21","v":4},{"$f":"AC21","v":64.219119251483306},{"$f":"IF(ProjectData!B$24=\"Y\",DefaultData!AA21,DefaultData!AA34)","v":10000},{"$f":"IF(ProjectData!C$24=\"Y\",DefaultData!AB21,DefaultData!AB34)","v":4},{"$f":"IF(ProjectData!D$24=\"Y\",DefaultData!AC21,DefaultData!AC34)","v":64.219119251483306},null,"  Project Management",7.6843699914374165E-3,23,7.6843699914374165E-3,8.3999328005375969E-3,6.5095690665277961E-3,1.0402579839800271E-2,null,null,null,null,"  Project Management",null,null,6.9242487190139873E-3,1,{"$f":"AV34*AW$13^AW34","v":6.9242487190139873E-3},{"$f":"AX34/AX$37","v":7.6843699914374165E-3},null,7.6641776337399003E-3,{"$f":"BB$11","v":1},{"$f":"BA34*BB$13^BB34","v":7.6641776337399003E-3},{"$f":"BC34/BC$37","v":8.3999328005375969E-3},5.164755707055056E-3,{"$f":"BF$11","v":1},{"$f":"BE34*BF$13^BF34","v":5.164755707055056E-3},{"$f":"BG34/BG$37","v":6.5095690665277961E-3},9.7487390775640465E-3,{"$f":"BJ$11","v":1},{"$f":"BI34*BJ$13^BJ34","v":9.7487390775640465E-3},{"$f":"BK34/BK$37","v":1.0402579839800271E-2}]
[null,null,"Labor",{"$f":"G$9*F35","v":0.76},{"$f":"D35/F$5","v":7.6000000000000004E-5},{"$f":"AI41","v":0.21078585682370676},1,1,1,1,1,null,{"$f":"(M$13-H$13)/(I$13-H$13)","v":-0.42857142857142855},{"$f":"+I35-H35","v":0},{"$f":"H35+(N35*M35)","v":1},{"$f":"(M$13-I$13)/(J$13-I$13)","v":-0.5},{"$f":"J35-I35","v":0},{"$f":"I35+(P35*Q35)","v":1},{"$f":"IF((M$13-J$13)/(K$13-J$13)>1,1,(M$13-J$13)/(K$13-J$13))","v":-3},{"$f":"K35-J35","v":0},{"$f":"J35+(S35*T35)","v":1},null,null,null,null,"  Fuel",{"$f":"AA22","v":3500},null,null,null,null,null,null,null,5.1595055656794085E-2,24,5.1595055656794085E-2,5.6399548803609575E-2,4.370710658954377E-2,6.2415479038801625E-2,null,null,null,null,"  Subtotal",null,null,4.6491384256236772E-2,null,{"$f":"SUM(AX31:AX34)","v":4.6491384256236772E-2},{"$f":"SUM(AY31:AY34)","v":5.1595055656794085E-2},null,5.1459478397967905E-2,null,{"$f":"SUM(BC31:BC34)","v":5.1459478397967905E-2},{"$f":"SUM(BD31:BD34)","v":5.6399548803609575E-2},3.4677645461655374E-2,null,{"$f":"SUM(BG31:BG34)","v":3.4677645461655374E-2},{"$f":"SUM(BH31:BH34)","v":4.370710658954377E-2},5.8492434465384276E-2,null,{"$f":"SUM(BK31:BK34)","v":5.8492434465384276E-2},{"$f":"SUM(BL31:BL34)","v":6.2415479038801625E-2}]
[null,null,"Materials and Services",{"$f":"(G$9-D$35)*F36","v":2.8455550000000001},{"$f":"D36/F$5","v":2.8455549999999998E-4},{"$f":"AI44+AI45+AI46","v":1},{"$f":"IF(ProjectData!$B$12=\"United States\",1,0.5)","v":0.5},0,{"$f":"(0.65/3.3)","v":0.19696969696969699},0.5,0.5,null,{"$f":"(M$13-H$13)/(I$13-H$13)","v":-0.42857142857142855},{"$f":"+I36-H36","v":0.19696969696969699},{"$f":"H36+(N36*M36)","v":-8.4415584415584416E-2},{"$f":"(M$13-I$13)/(J$13-I$13)","v":-0.5},{"$f":"J36-I36","v":0.30303030303030298},{"$f":"I36+(P36*Q36)","v":4.5454545454545497E-2},{"$f":"IF((M$13-J$13)/(K$13-J$13)>1,1,(M$13-J$13)/(K$13-J$13))","v":-3},{"$f":"K36-J36","v":0},{"$f":"J36+(S36*T36)","v":0.5},null,null,null,null,"  Other",null,null,null,"Calculations",null,null,null,null,1,25,1,1.0000000000000002,1,1,null,null,null,null,"Subtotal",null,null,1,null,{"$f":"AX35+AX29+AX23","v":1},{"$f":"AY35+AY29+AY23","v":1},null,1,null,{"$f":"BC35+BC29+BC23","v":1},{"$f":"BD35+BD29+BD23","v":1.0000000000000002},1,null,{"$f":"BG35+BG29+BG23","v":1},{"$f":"BH35+BH29+BH23","v":1},1,null,{"$f":"BK35+BK29+BK23","v":1},{"$f":"BL35+BL29+BL23","v":1}]
[null,null,"Subtotal",{"$f":"D36+D35","v":3.6055549999999998},{"$f":"E36+E35","v":3.6055549999999999E-4},null,null,null,null,null,null,null,null,null,null,null,null,null,null,null,null,null,null,null,null,null,"Percentage","Cost",null,"Percentage",null,null,null,null,null,26,null,null,null,null,null,null,null,null,"Sales Tax (Materials & Equipment Purchases)",null,null,null,null,{"$f":"AX36-AX29","v":0.90108216115694306},null,null,null,null,{"$f":"BC36-BC29","v":0.91240939847154401},null,null,null,{"$f":"BG36-BG29","v":0.7934097717177977},null,null,null,{"$f":"BK36-BK29","v":0.93714628752623175}]
[null,null,"Sales Tax (Materials & Equipment Purchases)",{"$f":"D36*(2.1/3.3)*D61","v":0.13581057954545456},{"$f":"D38/F$5","v":1.3581057954545455E-5},null,1,null,null,null,null,null,null,null,null,null,null,null,null,null,null,null,null,null,null,"Labor",{"$f":"AB38/AA$34","v":0.32000000000000017},{"$f":"AB34*(Z43*10)","v":3200.0000000000018},null,{"$f":"IF(ProjectData!B$24=\"Y\",DefaultData!AA25,DefaultData!AA38)","v":0.32000000000000017},null,null,null,null,null,27,null,null,null,null,null,null,null,null,"Total"]
[null,null,"Total",{"$f":"D38+D37","v":3.7413655795454543},{"$f":"E38+E37","v":3.7413655795454542E-4},null,null,null,null,null,null,null,null,null,null,null,null,null,null,null,null,null,null,null,null,"Fuel",{"$f":"AB39/AA$34","v":0.35},{"$f":"AA35","v":3500},null,{"$f":"IF(ProjectData!B$24=\"Y\",DefaultData!AA26,DefaultData!AA39)","v":0.35},null,null,null,null,null,28,null,null,null,null,null,null,null,null,"Hydro System Annual Operating and Maintenance Costs"]
[null,null,null,null,null,null,null,null,null,null,null,null,null,null,null,null,null,null,null,null,null,null,null,null,null,"Other",{"$f":"1-(AA38+AA39)","v":0.32999999999999985},{"$f":"AA40*AA34","v":3299.9999999999986},null,{"$f":"IF(ProjectData!B$24=\"Y\",DefaultData!AA27,DefaultData!AA40)","v":0.32999999999999985},null,null,null,null,null,29,null,null,null,null,null,null,null,null,"Labor"]
[null,null,"Other Parameters",null,null,null,null,null,null,null,null,null,null,null,null,null,null,null,null,null,null,null,null,null,null,"Total",null,{"$f":"SUM(AB38:AB40)","v":10000},null,null,null,null,null,null,{"$f":"HLOOKUP(AI$12,AK$12:AP$48,AJ41)","v":0.21078585682370676},30,{"$f":"AX41","v":0.21078585682370676},{"$f":"BC41","v":0.22680778487878464},{"$f":"BG41","v":0.18941494458989797},{"$f":"BK41","v":0.39969436704066952},null,null,null,null,"  Technicians/Personnel",null,null,0.21078585682370676,1,{"$f":"AV41*AW$13^AW41","v":0.21078585682370676},null,null,0.22680778487878464,{"$f":"BB$11","v":1},{"$f":"BA41*BB$13^BB41","v":0.22680778487878464},null,0.18941494458989797,{"$f":"BF$11","v":1},{"$f":"BE41*BF$13^BF41","v":0.18941494458989797},null,0.39969436704066952,{"$f":"BJ$11","v":1},{"$f":"BI41*BJ$13^BJ41","v":0.39969436704066952}]
[null,null,"Financial Parameters",null,null,"Local Share",null,null,null,null,null,null,null,null,null,null,null,null,null,null,null,null,null,null,null,"Employer Cost","Wage per hour","Employer Ben Costs",null,"Earnings per year (incl empl costs)",null,null,null,null,{"$f":"HLOOKUP(AI$12,AK$12:AP$48,AJ42)","v":0},31,null,null,null,null,null,null,null,null,"  Subtotal"]
[null,null,"Debt Financing",null,null,null,null,null,null,null,null,null,null,null,null,null,null,null,null,null,null,null,null,null,null,{"$f":"AA43+AB43","v":80.000000000000043},{"$f":"AC34","v":64.219119251483306},{"$f":"AA43*Calculations!K29","v":15.780880748516738},null,{"$f":"Z43*40*52","v":166400.00000000009},null,null,null,null,null,32,null,null,null,null,null,null,null,null,"Materials and Services"]
[null,null,"  Percentage financed",0.2,null,{"$f":"IF(ProjectData!$B$12=\"United States\",1,0)","v":0},null,null,null,null,null,null,null,null,null,null,null,null,null,null,null,null,null,null,null,"Calculation",null,null,null,null,null,null,null,null,{"$f":"HLOOKUP(AI$12,AK$12:AP$48,AJ44)","v":0.69137655044446511},33,{"$f":"AY44","v":0.69137655044446511},{"$f":"BD44","v":0.68928982903327274},{"$f":"BH44","v":0.65055936390707658},{"$f":"BL44","v":0.73979790940508783},null,null,null,null,"  Replacement Parts + consumables",null,null,0.54564415187120985,1,{"$f":"AV44*AW$13^AW44","v":0.54564415187120985},{"$f":"AX44/AX$49","v":0.69137655044446511},null,0.53295352977075994,{"$f":"BB$11","v":1},{"$f":"BA44*BB$13^BB44","v":0.53295352977075994},{"$f":"BC44/BC$49","v":0.68928982903327274},0.52733369804017838,{"$f":"BF$11","v":1},{"$f":"BE44*BF$13^BF44","v":0.52733369804017838},{"$f":"BG44/BG$49","v":0.65055936390707658},0.44410485226741059,{"$f":"BJ$11","v":1},{"$f":"BI44*BJ$13^BJ44","v":0.44410485226741059},{"$f":"BK44/BK$49","v":0.73979790940508783}]
[null,null,"  Years financed (term)",20,null,null,null,null,null,null,null,null,null,null,null,null,null,null,null,null,null,null,null,null,null,{"$f":"IF(ProjectData!$B24=\"y\",DefaultData!Z30,Z43)","v":80.000000000000043},{"$f":"IF(ProjectData!$B24=\"y\",DefaultData!AA30,AA43)","v":64.219119251483306},{"$f":"IF(ProjectData!$B24=\"y\",DefaultData!AB30,AB43)","v":15.780880748516738},null,{"$f":"Z45*40*52","v":166400.00000000009},null,null,null,null,{"$f":"HLOOKUP(AI$12,AK$12:AP$48,AJ45)","v":4.2171035175914723E-2},34,{"$f":"AY45","v":4.2171035175914723E-2},{"$f":"BD45","v":4.631675643754668E-2},{"$f":"BH45","v":3.6896341266559149E-2},{"$f":"BL45","v":3.6989895470254393E-2},null,null,null,null,"  Facilities",null,null,3.3281977393216859E-2,1,{"$f":"AV45*AW$13^AW45","v":3.3281977393216859E-2},{"$f":"AX45/AX$49","v":4.2171035175914723E-2},null,3.5811755507176524E-2,{"$f":"BB$11","v":1},{"$f":"BA45*BB$13^BB45","v":3.5811755507176524E-2},{"$f":"BC45/BC$49","v":4.631675643754668E-2},2.9907622829983885E-2,{"$f":"BF$11","v":1},{"$f":"BE45*BF$13^BF45","v":2.9907622829983885E-2},{"$f":"BG45/BG$49","v":3.6896341266559149E-2},2.2205242613370531E-2,{"$f":"BJ$11","v":1},{"$f":"BI45*BJ$13^BJ45","v":2.2205242613370531E-2},{"$f":"BK45/BK$49","v":3.6989895470254393E-2}]
[null,null,"  Interest rate",0.1,null,null,null,null,null,null,null,null,null,null,null,null,null,null,null,null,null,null,null,null,null,null,null,null,null,null,null,null,null,null,{"$f":"HLOOKUP(AI$12,AK$12:AP$48,AJ46)","v":0.26645241437962014},35,{"$f":"AY46","v":0.26645241437962014},{"$f":"BD46","v":0.26439341452918053},{"$f":"BH46","v":0.31254429482636426},{"$f":"BL46","v":0.22321219512465779},null,null,null,null,"  Insurance",null,null,0.21028801391186655,1,{"$f":"AV46*AW$13^AW46","v":0.21028801391186655},{"$f":"AX46/AX$49","v":0.26645241437962014},null,0.20442692984327879,{"$f":"BB$11","v":1},{"$f":"BA46*BB$13^BB46","v":0.20442692984327879},{"$f":"BC46/BC$49","v":0.26439341452918053},0.25334373453993975,{"$f":"BF$11","v":1},{"$f":"BE46*BF$13^BF46","v":0.25334373453993975},{"$f":"BG46/BG$49","v":0.31254429482636426},0.13399553807854925,{"$f":"BJ$11","v":1},{"$f":"BI46*BJ$13^BJ46","v":0.13399553807854925},{"$f":"BK46/BK$49","v":0.22321219512465779}]
[null,null,"  Average Annual Payment (Interest and Principal) million$",{"$f":"Calculations!F186","v":1.0314915},null,null,null,null,null,null,null,null,null,null,null,null,null,null,null,null,null,null,null,null,null,"O&M Default",null,null,null,null,null,null,null,null,{"$f":"HLOOKUP(AI$12,AK$12:AP$48,AJ47)","v":1},36,{"$f":"AY47","v":1},{"$f":"BD47","v":0.99999999999999989},{"$f":"BH47","v":1},{"$f":"BL47","v":1},null,null,null,null,"  Subtotal",null,null,0.78921414317629324,null,{"$f":"SUM(AX44:AX46)","v":0.78921414317629324},{"$f":"SUM(AY44:AY46)","v":1},null,0.77319221512121528,null,{"$f":"SUM(BC44:BC46)","v":0.77319221512121528},{"$f":"SUM(BD44:BD46)","v":0.99999999999999989},0.81058505541010206,null,{"$f":"SUM(BG44:BG46)","v":0.81058505541010206},{"$f":"SUM(BH44:BH46)","v":1},0.60030563295933037,null,{"$f":"SUM(BK44:BK46)","v":0.60030563295933037},{"$f":"SUM(BL44:BL46)","v":1}]
[null,null,"Equity Financing/Repayment",null,null,"Local Share",null,null,null,null,null,null,null,null,null,null,null,null,null,null,null,null,null,null,null,"Employer Cost","Wage per hour","Employer Ben Costs",null,"Earnings per year (incl empl costs)",null,null,null,null,{"$f":"HLOOKUP(AI$12,AK$12:AP$48,AJ48)","v":6.8161805017297766E-2},37,{"$f":"AK50/AK13","v":6.8161805017297766E-2},{"$f":"AL50/AL13","v":7.3375851271158615E-2},{"$f":"AM50/AM13","v":5.9208095385659687E-2},{"$f":"AN50/AN13","v":5.7766935868689619E-2},null,null,null,null,"Total",null,null,1,null,{"$f":"AX47+AX41","v":1},null,null,1,null,{"$f":"BC47+BC41","v":0.99999999999999989},null,1,null,{"$f":"BG47+BG41","v":1},null,1,null,{"$f":"BK47+BK41","v":0.99999999999999989}]
[null,null,"  Percentage equity",{"$f":"1-D44","v":0.8},null,null,null,null,null,null,null,null,null,null,null,null,null,null,null,null,null,null,null,null,null,{"$f":"AA49+AB49","v":38.461538461538446},{"$f":"G104","v":30.8745765632131},{"$f":"H104*AA49","v":7.586961898325348},null,{"$f":"Z49*40*52","v":79999.999999999971},{"$f":"AA49*40*52","v":64219.119251483251},null,null,null,null,null,null,null,null,null,null,null,null,null,null,null,null,null,null,{"$f":"AX47","v":0.78921414317629324},null,null,null,null,{"$f":"BC47","v":0.77319221512121528},null,null,null,{"$f":"BG47","v":0.81058505541010206},null,null,null,{"$f":"BK47","v":0.60030563295933037}]
[null,null,"  Individual Investors (percent of equity)",0,null,1,null,null,null,null,null,null,null,null,null,null,null,null,null,null,null,null,null,null,null,"User Defined",null,null,null,null,null,null,null,null,null,null,360.55549999999999,335.08550000000002,401.2355,225.17205000000001]
[null,null,"  Corporate Investors (percent of equity)",{"$f":"1-D50","v":1},null,{"$f":"IF(ProjectData!$B$12=\"United States\",1,0)","v":0},null,null,null,null,null,null,null,null,null,null,null,null,null,null,null,null,null,null,null,"Employer Cost","Wage per hour","Employer Ben Costs",null,"Earnings per year (incl empl costs)"]
[null,null,"  Return on equity",0.12,null,null,null,null,null,null,null,null,null,null,null,null,null,null,null,null,null,null,null,null,null,{"$f":"AA52+AB52","v":38.461538461538446},{"$f":"AA49","v":30.8745765632131},{"$f":"AB49","v":7.586961898325348},null,{"$f":"Z52*40*52","v":79999.999999999971}]
[null,null,"  Repayment term (years)",10]
[null,null,"Tax Parameters",null,null,null,null,null,null,null,null,null,null,null,null,null,null,null,null,null,null,null,null,null,null,"Calculation","Wage per hour","Employer Ben Costs",null,"Earnings per year (incl empl costs)"]
[null,null,"  Local Property Tax (percent of taxable value)",0,null,null,null,null,null,null,null,null,null,null,null,null,null,null,null,null,null,null,null,null,null,{"$f":"IF(ProjectData!$B24=\"y\",DefaultData!Z49,DefaultData!Z52)","v":38.461538461538446},{"$f":"IF(ProjectData!$B24=\"y\",DefaultData!AA49,DefaultData!AA52)","v":30.8745765632131},{"$f":"IF(ProjectData!$B24=\"y\",DefaultData!AB49,DefaultData!AB52)","v":7.586961898325348},null,{"$f":"IF(ProjectData!$B24=\"y\",DefaultData!AD49,DefaultData!AD52)","v":79999.999999999971},null,null,null,null,null,null,null,null,null,null,null,null,null,null,null,null,null,null,null,null,null,null,null,null,null,null,null,null,null,null,null,null,null,null,null,null,null,null,null,null,null,null,null,null,null,null,null,null,null,null,null,null,null,null,null,null,null,null,null,null,null,null,"Simple Avg Cost"]
[null,null,"  Assessed Value (percent of construction cost)",1,null,null,null,null,null,null,null,null,null,null,null,null,null,null,null,null,null,null,null,null,{"$f":"ProjectData!B$12","v":"California"},null,null,null,null,null,null,"System Size (kW)",null,null,null,"Alabama","Alaska","Arizona","Arkansas","California","Colorado","Connecticut","Delaware","District of Columbia","Florida","Georgia","Hawaii","Idaho","Illinois","Indiana","Iowa","Kansas","Kentucky","Louisiana","Maine","Maryland","Massachusetts","Michigan","Minnesota","Mississippi","Missouri","Montana","MyCounty","MyRegion","Nebraska","Nevada","New Hampshire","New Jersey","New Mexico","New York","North Carolina","North Dakota","Ohio","Oklahoma","Oregon","Pennsylvania","Rhode Island","South Carolina","South Dakota","Tennessee","Texas","Utah","Vermont","Virginia","Washington","West Virginia","Wisconsin","Wyoming","Avg.",null,null,null,{"$f":"IF(AJ64<CN57,CO57,IF(AJ64<CN58,CO58,IF(AJ64<CN59,CO59,IF(AJ64<CN60,CO60,IF(AJ64<CN61,CO61,IF(AJ64<CN62,CO62,IF(AJ64<CN63,CO63,IF(AJ64<CN64,CO64,CO65))))))))*1000","v":0},"System Size"]
[null,null,"  Taxable Value (percent of assessed value)",1,null,null,null,null,null,null,null,null,null,null,null,null,null,null,null,null,null,null,null,null,{"$f":"HLOOKUP(Y$56,AJ$56:CJ$60,AI57)","v":"Wave Power"},null,null,null,null,null,null,0,10,2,2,"Wave Power","Wave Power","River Current","River Current","Wave Power","River Current","Wave Power","Wave Power","River Current","Wave Power","Wave Power","Wave Power","River Current","Wave Power","Wave Power","River Current","River Current","River Current","Wave Power","Wave Power","River Current","Wave Power","Wave Power","River Current","Wave Power","River Current","River Current","Wave Power","Wave Power","River Current","River Current","Wave Power","Wave Power","River Current","Wave Power","Wave Power","River Current","Wave Power","River Current","Wave Power","Wave Power","Wave Power","Wave Power","River Current","River Current","Wave Power","River Current","River Current","Wave Power","Wave Power","River Current","Wave Power","River Current",null,null,null,2,0,"<2 kW"]
[null,null,"  Taxable Value ( million$ - if applicable)",{"$f":"+D30*D56*D57","v":52.896999999999991},null,null,null,null,null,null,null,null,null,null,null,null,null,null,null,null,null,null,null,null,{"$f":"HLOOKUP(Y$56,AJ$56:CJ$60,AI58)","v":"Tidal Power"},null,null,null,null,null,null,10,100,{"$f":"AH57+1","v":3},3,"Tidal Power","Tidal Power",null,null,"Tidal Power",null,"Tidal Power","Tidal Power",null,"Tidal Power","Tidal Power","Tidal Power",null,"Tidal Power","Tidal Power",null,null,null,"Tidal Power","Tidal Power",null,"Tidal Power","Tidal Power",null,"Tidal Power",null,null,"Tidal Power","Tidal Power",null,null,"Tidal Power","Tidal Power",null,"Tidal Power","Tidal Power",null,"Tidal Power",null,"Tidal Power","Tidal Power","Tidal Power","Tidal Power",null,null,"Tidal Power",null,null,"Tidal Power","Tidal Power",null,"Tidal Power",null,null,null,null,5,0,"2-5 kW"]
[null,null,"  Property Tax Exemption (percent of local taxes)",{"$f":"AJ75","v":1},null,null,null,null,null,null,null,null,null,null,null,null,null,null,null,null,null,null,null,null,{"$f":"HLOOKUP(Y$56,AJ$56:CJ$60,AI59)","v":"Ocean Current"},null,null,null,null,null,null,100,500,{"$f":"AH58+1","v":4},4,"Ocean Current","Ocean Current",null,null,"Ocean Current",null,"Ocean Current","Ocean Current",null,"Ocean Current","Ocean Current","Ocean Current",null,"Ocean Current","Ocean Current",null,null,null,"Ocean Current","Ocean Current",null,"Ocean Current","Ocean Current",null,"Ocean Current",null,null,"Ocean Current","Ocean Current",null,null,"Ocean Current","Ocean Current",null,"Ocean Current","Ocean Current",null,"Ocean Current",null,"Ocean Current","Ocean Current","Ocean Current","Ocean Current",null,null,"Ocean Current",null,null,"Ocean Current","Ocean Current",null,"Ocean Current",null,null,null,null,10,0,"5-10 kW"]
[null,null,"  Local Property Taxes",{"$f":"+D55*D58*(1-D59)","v":0},null,1,null,null,null,null,null,null,null,null,null,null,null,null,null,null,null,null,null,null,{"$f":"HLOOKUP(Y$56,AJ$56:CJ$60,AI60)","v":"River Current"},null,null,null,null,null,null,500,null,5,5,"River Current","River Current",null,null,"River Current",null,"River Current","River Current",null,"River Current","River Current","River Current",null,"River Current","River Current",null,null,null,"River Current","River Current",null,"River Current","River Current",null,"River Current",null,null,"River Current","River Current",null,null,"River Current","River Current",null,"River Current","River Current",null,"River Current",null,"River Current","River Current","River Current","River Current",null,null,"River Current",null,null,"River Current","River Current",null,"River Current",null,null,null,null,30,0,"10-30 kW"]
[null,null,"  Local Sales Tax Rate",{"$f":"AJ78","v":7.4999999999999997E-2},null,1,null,null,null,null,null,null,null,null,null,null,null,null,null,null,null,null,null,null,null,null,null,null,null,null,null,null,null,6,null,null,null,null,null,null,null,null,null,null,null,null,null,null,null,null,null,null,null,null,null,null,null,null,null,null,null,null,null,null,null,null,null,null,null,null,null,null,null,null,null,null,null,null,null,null,null,null,null,null,null,null,null,null,null,null,null,100,0,"30-100 kW"]
[null,null,"Lease Cost (if applicable)",0,null,1,null,null,null,null,null,null,null,null,null,null,null,null,null,null,null,null,null,null,null,null,null,null,null,null,null,null,null,7,null,null,null,null,null,null,null,null,null,null,null,null,null,null,null,null,null,null,null,null,null,null,null,null,null,null,null,null,null,null,null,null,null,null,null,null,null,null,null,null,null,null,null,null,null,null,null,null,null,null,null,null,null,null,null,null,null,250,0,"100-250 kW"]
[null,null,null,null,null,null,null,null,null,null,null,null,null,null,null,null,null,null,null,null,null,null,null,null,null,null,null,null,null,null,null,null,null,8,"State",{"$f":"ProjectData!B12","v":"California"},null,null,null,null,null,null,null,null,null,null,null,null,null,null,null,null,null,null,null,null,null,null,null,null,null,null,null,null,null,null,null,null,null,null,null,null,null,null,null,null,null,null,null,null,null,null,null,null,null,null,null,null,null,null,null,500,0,"250-500 kW"]
[null,null,null,null,null,null,null,null,null,null,null,null,null,null,null,null,null,null,null,null,null,null,null,null,null,null,null,null,null,null,null,null,null,9,"System Size",{"$f":"ProjectData!B17","v":10},null,null,null,null,null,null,null,null,null,null,null,null,null,null,null,null,null,null,null,null,null,null,null,null,null,null,null,null,null,null,null,null,null,null,null,null,null,null,null,null,null,null,null,null,null,null,null,null,null,null,null,null,null,null,null,750,0,"500-750 kW"]
[null,null,null,null,null,null,null,null,null,null,null,null,null,null,null,null,null,null,null,null,null,null,null,null,null,null,null,null,null,null,null,null,null,10,"Offset",{"$f":"IF($AJ64>$AF60,AH60,IF($AJ64>$AF59,AH59,IF($AJ64>$AF58,$AH58,$AH57)))","v":2},null,null,null,null,null,null,null,null,null,null,null,null,null,null,null,null,null,null,null,null,null,null,null,null,null,null,null,null,null,null,null,null,null,null,null,null,null,null,null,null,null,null,null,null,null,null,null,null,null,null,null,null,null,null,null,null,0,">750 kW"]
[null,null,null,null,null,null,null,null,null,null,null,null,null,null,null,null,null,null,null,null,null,null,null,null,null,null,null,null,null,null,null,null,null,11]
[null,null,null,null,null,null,null,null,null,null,null,null,null,null,null,null,null,null,null,null,null,null,null,null,null,null,null,null,null,null,null,null,null,12,"Base Cost",null,{"$f":"IF($AJ64>$AF60,CK60,IF($AJ64>$AF59,CK59,IF($AJ64>$AF58,$CK58,$CK57)))*1000","v":0}]
[null,null,null,null,null,null,null,null,null,null,null,null,null,null,null,null,null,null,null,null,null,null,null,null,null,null,null,null,null,null,null,null,null,13,"State Cost"]
[null,null,null,null,null,null,null,null,null,null,null,null,null,null,null,null,null,null,null,null,null,null,null,null,null,null,null,null,null,null,null,null,null,14]
[null,null,null,null,null,null,null,null,null,null,null,null,null,null,null,null,null,null,null,null,null,null,null,null,null,null,null,null,null,null,null,null,null,15,"Sales Tax Rate",0.04,0,5.6000000000000001E-2,6.5000000000000002E-2,7.4999999999999997E-2,2.9000000000000001E-2,6.3500000000000001E-2,0,5.7500000000000002E-2,0.06,0.04,0.04,0.06,6.25E-2,7.0000000000000007E-2,0.06,6.5000000000000002E-2,0.06,0.05,5.5E-2,0.06,6.25E-2,0.06,6.8750000000000006E-2,7.0000000000000007E-2,4.2250000000000003E-2,0,{"$f":"'User Add-in Location'!B6","v":0},{"$f":"'User Add-in Location'!B6","v":0},5.5E-2,6.8500000000000005E-2,0,7.0000000000000007E-2,5.1249999999999997E-2,0.04,4.7500000000000001E-2,0.05,5.7500000000000002E-2,4.4999999999999998E-2,0,0.06,7.0000000000000007E-2,0.06,4.4999999999999998E-2,7.0000000000000007E-2,6.25E-2,4.7E-2,0.06,4.2999999999999997E-2,6.5000000000000002E-2,0.06,0.05,0.04,5.1499999999999997E-2]
[null,null,null,null,null,null,null,null,null,null,null,null,null,null,null,null,null,null,null,null,null,null,null,null,null,null,null,null,null,null,null,null,null,16]
[null,null,null,null,null,null,null,null,null,null,null,null,null,null,null,null,null,null,null,null,null,null,null,null,null,null,null,null,null,null,null,null,null,17,"PropertyTax Exemption"]
[null,null,null,null,null,null,null,null,null,null,null,null,null,null,null,null,null,null,null,null,null,null,null,null,null,null,null,null,null,null,null,null,null,18,"Rate",1,1,1,1,1,1,1,1,1,1,1,1,1,1,1,1,1,1,1,1,1,1,1,1,1,1,1,1,1,1,1,1,1,1,1,1,1,1,1,1,1,1,1,1,1,1,1,1,1,1,1,1,1]
[]
[null,null,null,null,null,null,null,null,null,null,null,null,null,null,null,null,null,null,null,null,null,null,null,null,null,null,null,null,null,null,null,null,null,null,"Prop Tax Exemption",{"$f":"HLOOKUP(AJ$63,AJ$56:CJ$73,AJ76)","v":1},"Tax Rate",{"$f":"1-AJ75","v":0}]
[null,null,null,null,null,null,null,null,null,null,null,null,null,null,null,null,null,null,null,null,null,null,null,null,null,null,null,null,null,null,null,null,null,null,"Offset",{"$f":"AH73","v":18}]
[]
[null,null,null,null,null,null,null,null,null,null,null,null,null,null,null,null,null,null,null,null,null,null,null,null,null,null,null,null,null,null,null,null,null,null,"Sales Tax Rate",{"$f":"HLOOKUP(AJ$63,AJ$56:CJ$73,AJ79)","v":7.4999999999999997E-2},{"$f":"AJ78","v":7.4999999999999997E-2}]
[null,null,null,null,null,null,null,null,null,null,null,null,null,null,null,null,null,null,null,null,null,null,null,null,null,null,null,null,null,null,null,null,null,null,"Offset",{"$f":"$AH70","v":15},{"$f":"$AH70","v":15}]
[]
[null,null,"Margins"]
[null,null,null,"Agriculture","Mining","Construction","Other Manufacturing","Fabricated Metals","Machinery","Electrical Equipment","TCPU","Wholesale Trade","Retail Trade","FIRE","Other Services","Professional Services","Government","Total"]
[null,null,"Agriculture",0.58366899999999999,0,0,0,0,0,0,5.1572E-2,7.2450000000000001E-2,0.29230899999999999,0,0,0,0,{"$f":"SUM(D83:Q83)","v":1}]
[null,null,"Mining",0,0.36205100000000001,0,0,0,0,0,{"$f":"0.284423+0.346126","v":0.63054900000000003},7.4000000000000003E-3,0,0,0,0,0,{"$f":"SUM(D84:Q84)","v":1}]
[null,null,"Construction",0,0,1,0,0,0,0,0,0,0,0,0,0,0,1]
[null,null,"Manufacturing",0,0,0,0.55841200000000002,0,0,0,2.3014E-2,{"$f":"0.080398+0.338175","v":0.41857299999999997},0,0,0,0,0,0.99999899999999997]
[null,null,"Fabricated Metals",0,0,0,0,1,0,0,0,0,0,0,0,0,0,1]
[null,null,"Machinery",0,0,0,0,0,0.63125100000000001,0,{"$f":"0.000889","v":8.8900000000000003E-4},{"$f":"0.1018+0.266059","v":0.36785899999999999},0,0,0,0,0,0.99999900000000008]
[null,null,"Electrical Equipment",0,0,0,0,0,0,0.51277399999999995,1.2135999999999999E-2,{"$f":"0.075345+0.399745","v":0.47509000000000001},0,0,0,0,0,1]
[null,null,"TCPU",0,0,0,0,0,0,0,1,0,0,0,0,0,0,1]
[null,null,"Wholesale Trade",0,0,0,0,0,0,0,0,1,0,0,0,0,0,1]
[null,null,"Retail Trade",0,0,0,0,0,0,0,0,{"$f":"1-M92","v":0.68871400000000005},0.31128600000000001,0,0,0,0,1]
[null,null,"FIRE",0,0,0,0,0,0,0,0,0,0,1,0,0,0,1]
[null,null,"Misc. Services",0,0,0,0,0,0,0,4.2428E-2,9.2082999999999998E-2,0.361097,0,0.50439199999999995,0,0,1]
[null,null,"Professional Services",0,0,0,0,0,0,0,0,0,0,0,0,1,0,1]
[null,null,"Government",0,0,0,0,0,0,0,0,0,0,0,0,0,1,1]
[]
[]
[]
[null,null,"Labor Parameters",null,null,null,null,null,null,"User Revised (per KW)"]
[null,null,"  Construction and Installation Labor","Day Rate","Fuel Cost","Crew","Wage Per Hour","Employer Cost",null,"Cost Adj."]
[null,null,"  Vessel",10000,3500,4,{"$f":"64.2191192514833*J102","v":64.219119251483306},{"$f":"Calculations!K29","v":0.24573492960435203},null,{"$f":"ProjectData!B19/DefaultData!AI13","v":1}]
[null,null,"  O&M Labor"]
[null,null,"  Operators/Personnel ",null,null,null,{"$f":"30.8745765632131*J104","v":30.8745765632131},{"$f":"Calculations!K29","v":0.24573492960435203},null,{"$f":"ProjectData!B20/DefaultData!AI48","v":1}]

{"sheet":"Calculations","index":7,"n_rows":222,"n_cols":37,"rows_kept":222,"cut":false,"hidden":false,"merged":[]}
[null,null,"Economic Impact Analysis for ",null,{"$f":"ProjectData!B12","v":"California"},{"$f":"Project_Data","v":"Marine and Hydrokinetic Project Data"}]
[]
[null,null,null,null,null,null,null,null,null,null,null,null,null,null,null,null,null,null,null,null,null,null,null,null,null,null,null,"Detailed Hydro Project Data Costs",{"$f":"IF(ProjectData!B$12=\"MyCounty\",'User Add-in Location'!B$3,IF(ProjectData!B$12=\"MyRegion\",'User Add-in Location'!B4,ProjectData!B$12))","v":"California"},{"$f":"ProjectData!_xlnm.Print_Area","v":2011}]
[null,null,"Project Construction Costs ",null,null,null,null,null,null,null,null,null,null,null,null,null,null,"Cable Landing and Grid Interconnection"]
["Warning",null,{"$f":"DefaultData!C14","v":"Installed Capital Costs"},"Cost","Local Share",null,"Local $ Spending",null,null,null,null,null,null,null,null,null,null,"Cable Landing",{"$f":"200000/1100000","v":0.18181818181818182},null,null,null,null,null,null,null,null,"Construction Costs ","Cost","Local Share"]
[null,null,{"$f":"DefaultData!C15","v":"Tidal Power"},null,null,null,null,null,null,null,null,null,null,null,null,null,null,"Grid Interconnection",{"$f":"1-S5","v":0.81818181818181812},null,null,null,null,null,null,null,null,{"$f":"C6","v":"Tidal Power"}]
["This Worksheet contains Data and Formulas that are an integral part of the JEDI model.  ",null,{"$f":"DefaultData!C16","v":"  Device"},{"$f":"IF(ProjectData!$B$24=\"y\",DefaultData!D16,ProjectData!B31)","v":36.292321206006285},{"$f":"IF(ProjectData!$B$24=\"y\",ProjectData!T31,ProjectData!E31)","v":0.25},null,{"$f":"+E7*D7","v":9.0730803015015713},null,null,null,null,null,null,null,null,null,null,null,null,null,null,null,null,null,null,null,null,"  Device",{"$f":"D7","v":36.292321206006285},0.25]
[null,null,{"$f":"DefaultData!C17","v":"  Underwater Electrical Collector System"},{"$f":"IF(ProjectData!$B$24=\"y\",DefaultData!D17,ProjectData!B32)","v":4.8839752903238569},{"$f":"IF(ProjectData!$B$24=\"y\",ProjectData!T32,ProjectData!E32)","v":0},null,{"$f":"+E8*D8","v":0},null,null,null,null,null,null,null,null,null,null,null,null,null,null,null,null,null,null,null,null,"  Underwater Electrical Collector System",4.8839752903238569,0]
["Although the data and formulas are available for review they must not be changed.",null,{"$f":"DefaultData!C18","v":"  Underwater Transmission Cable"},{"$f":"IF(ProjectData!$B$24=\"y\",DefaultData!D18,ProjectData!B33)","v":0.7848685381921775},{"$f":"IF(ProjectData!$B$24=\"y\",ProjectData!T33,ProjectData!E33)","v":0},null,{"$f":"+E9*D9","v":0},null,null,null,null,null,null,null,null,null,null,"O&M Vessel and Equip",null,null,null,null,null,null,null,null,null,"  Underwater Transmission Cable",0.7848685381921775,0]
[null,null,{"$f":"DefaultData!C19","v":"  Cable Landing and Grid Interconnection"},{"$f":"IF(ProjectData!$B$24=\"y\",DefaultData!D19,ProjectData!B34)","v":1.1511405226818603},{"$f":"IF(ProjectData!$B$24=\"y\",ProjectData!T34,ProjectData!E34)","v":0},null,{"$f":"+E10*D10","v":0},null,null,null,null,null,null,null,null,null,null,"Vessel - tug purchase",0.5,null,null,null,"Cable Landing","Grid Interconnection",null,null,null,"  Cable Landing and Grid Interconnection",1.1511405226818603,0]
[null,null,{"$f":"DefaultData!C20","v":"  Balance of Plant"},{"$f":"IF(ProjectData!$B$24=\"y\",DefaultData!D20,ProjectData!B35)","v":2.0929827685124733},{"$f":"IF(ProjectData!$B$24=\"y\",ProjectData!T35,ProjectData!E35)","v":0.75},null,{"$f":"+E11*D11","v":1.569737076384355},null,null,null,null,null,null,null,null,null,null," Tug conversion",0.25,null,null,null,{"$f":"G10*S5","v":0},{"$f":"G10*S6","v":0},null,null,null,"  Balance of Plant",2.0929827685124733,0.75]
[null,null,{"$f":"DefaultData!C21","v":"  Subtotal"},{"$f":"SUM(D7:D11)","v":45.205288325716651},null,null,{"$f":"SUM(G7:G11)","v":10.642817377885926},null,null,null,null,null,null,null,null,null,null," Shore upgrades (contingency) cranes and modifications",0.25,null,null,null,"vessel   ","modifications","dock upgrade",null,null,"  Subtotal",{"$f":"D12","v":45.205288325716651}]
["Any changes to the data or formulas will impact the analysis and may invalidate the model results.",null,{"$f":"DefaultData!C22","v":"Installation/Labor"},null,null,null,null,null,null,null,null,null,null,null,null,null,null,null,null,null,null,null,{"$f":"$G11*$S10","v":0.7848685381921775},{"$f":"$G11*$S11","v":0.39243426909608875},{"$f":"$G11*$S12","v":0.39243426909608875},null,null,"Installation/Labor",0,{"$f":"E13","v":0}]
[null,null,{"$f":"DefaultData!C23","v":"  Mooring and Device Installation"},{"$f":"IF(ProjectData!$B$24=\"y\",DefaultData!D23,ProjectData!B38)","v":2.6162284606405919},{"$f":"IF(ProjectData!$B$24=\"y\",ProjectData!T38,ProjectData!E38)","v":0.25},null,{"$f":"+E14*D14","v":0.65405711516014797},null,null,null,null,null,null,null,null,null,null,null,null,null,null,null,null,null,null,null,null,"  Mooring and Device Installation",2.6162284606405919,0.25]
[null,null,{"$f":"DefaultData!C24","v":"  Underwater Cable Installation"},{"$f":"IF(ProjectData!$B$24=\"y\",DefaultData!D24,ProjectData!B39)","v":2.0929827685124733},{"$f":"IF(ProjectData!$B$24=\"y\",ProjectData!T39,ProjectData!E39)","v":0.25},null,{"$f":"+E15*D15","v":0.52324569212811833},null,null,null,null,null,null,null,null,null,null,"Overhead/Other",null,null,null,null,"Vessel days","Fuel","Labor","Overhead/Other",null,"  Underwater Cable Installation",2.0929827685124733,0.25]
[null,null,{"$f":"DefaultData!C25","v":"  Cable Landing and Grid Connection"},{"$f":"IF(ProjectData!$B$24=\"y\",DefaultData!D25,ProjectData!B40)","v":0.52324569212811833},{"$f":"IF(ProjectData!$B$24=\"y\",ProjectData!T40,ProjectData!E40)","v":0.25},null,{"$f":"+E16*D16","v":0.13081142303202958},null,null,null,null,null,null,null,null,null,null,"Wholesale/Mfg.",0.22069796317127188,null,null,null,{"$f":"G14/DefaultData!AD$34","v":6.5405711516014795E-5},{"$f":"$G14*DefaultData!$AD$39","v":0.22891999030605178},{"$f":"$G14*DefaultData!$AD$38","v":0.20929827685124747},{"$f":"$G14*DefaultData!$AD$40","v":0.21583884800284872},null,"  Cable Landing and Grid Connection",0.52324569212811833,0.25]
[null,null,{"$f":"DefaultData!C27","v":"  Subtotal"},{"$f":"SUM(D14:D16)","v":5.2324569212811838},null,null,{"$f":"SUM(G14:G16)","v":1.3081142303202959},null,null,null,null,null,null,null,null,null,null,"Misc. Services",0.2054499667210288,null,null,null,{"$f":"G15/DefaultData!AD$34","v":5.2324569212811836E-5},{"$f":"$G15*DefaultData!$AD$39","v":0.18313599224484139},{"$f":"$G15*DefaultData!$AD$38","v":0.16743862148099795},{"$f":"$G15*DefaultData!$AD$40","v":0.17267107840227897},null,"  Subtotal",5.2324569212811838,0]
[null,null,{"$f":"DefaultData!C28","v":"Permitting Cost"},{"$f":"IF(ProjectData!$B$24=\"y\",DefaultData!D28,ProjectData!B42)","v":2.4592547530021567},{"$f":"IF(ProjectData!$B$24=\"y\",ProjectData!T42,ProjectData!E42)","v":0.75},null,{"$f":"+E18*D18","v":1.8444410647516176},null,null,null,null,null,null,null,null,null,null,"Prof Services",null,null,null,null,{"$f":"G16/DefaultData!AD$34","v":1.3081142303202959E-5},{"$f":"$G16*DefaultData!$AD$39","v":4.5783998061210349E-2},{"$f":"$G16*DefaultData!$AD$38","v":4.1859655370249486E-2},{"$f":"$G16*DefaultData!$AD$40","v":4.3167769600569741E-2},null,"Permitting Cost",2.4592547530021567,0.75]
[null,null,"Subtotal",{"$f":"D18+D17+D12","v":52.896999999999991},null,null,{"$f":"G18+G17+G12","v":13.795372672957839},null,null,null,null,null,null,null,null,null,null,"Other",0.57385207010769934,null,null,null,{"$f":"SUM(W16:W18)","v":1.3081142303202959E-4},{"$f":"SUM(X16:X18)","v":0.45783998061210351},{"$f":"SUM(Y16:Y18)","v":0.41859655370249493},{"$f":"SUM(Z16:Z18)","v":0.43167769600569744},null,"Subtotal",{"$f":"AC18+AC17+AC12","v":52.896999999999991}]
[null,null,"Sales Tax (Materials & Equipment Purchases)",{"$f":"IF(ProjectData!$B$24=\"y\",DefaultData!$D31,ProjectData!B44)","v":3.3903966244287487},{"$f":"IF(ProjectData!$B$24=\"y\",ProjectData!T44,ProjectData!E44)","v":1},null,{"$f":"+E20*D20","v":3.3903966244287487},null,null,null,null,null,null,null,null,null,null,null,null,null,null,null,null,null,null,null,null,"Sales Tax (Materials & Equipment Purchases)",{"$f":"D20","v":3.3903966244287487},{"$f":"E20","v":1}]
[null,null,"Total",{"$f":"D20+D19","v":56.287396624428737},null,null,{"$f":"G20+G19","v":17.185769297386589},null,null,null,null,null,null,null,null,null,null,null,null,null,null,null,null,null,null,null,null,"Total",{"$f":"AC20+AC19","v":56.287396624428737}]
["To view the data and formulas simply scroll over to the adjacent columns to the right."]
[null,null,null,null,null,null,null,null,null,null,null,null,null,null,null,null,null,null,null,null,null,null,null,null,null,null,null,{"$f":"C63","v":"Annualized Operating and Maintenance Costs"}]
[null,null,null,null,null,null,null,null,null,null,null,null,null,null,null,null,null,null,null,null,null,null,null,null,null,null,null,null,"Cost","Local Share"]
[null,null,null,null,null,null,null,null,null,null,null,null,"O&M",null,null,null,null,null,null,null,null,null,null,null,null,null,null,{"$f":"C66","v":"Labor"},0.76,1]
[null,null,null,null,null,null,null,null,null,"Payroll expense","Default",null,"User Revised",null,null,null,null,null,null,null,null,null,null,null,null,null,null,"Materials and Services",2.8455550000000001,0.5]
[null,null,null,null,null,null,null,null,null,"Govt",7.1186945514116112E-2,null,{"$f":"K27","v":7.1186945514116112E-2},null,null,null,null,null,null,null,null,null,null,null,null,null,null,{"$f":"C68","v":"Subtotal"},3.6055549999999998]
[null,null,null,null,null,null,null,null,null,"Health/Ins/Misc",0.17454798409023592,null,{"$f":"K28","v":0.17454798409023592},null,null,null,null,null,null,null,null,null,null,null,null,null,null,"Sales Tax (Materials & Equipment Purchases)",0.13581057954545456,{"$f":"E69","v":1}]
[null,null,null,null,null,null,null,null,null,"Total",{"$f":"K28+K27","v":0.24573492960435203},null,{"$f":"M28+M27","v":0.24573492960435203},null,null,null,null,null,null,null,null,null,null,null,null,null,null,"Average Annual Debt Payment (Interest and Principal)",1.0314915,0]
[null,null,"Payroll Parameters"," Payroll Cost","wage/hour","Payroll expense","Payroll expense","Labor",null,null,null,null,null,null,null,null,null,null,null,null,null,null,null,null,null,null,null,"Equity Payment - Individuals",0,0]
[null,null,"  Construction Labor",null,null,null,null,null,null,null,null,null,null,null,null,null,null,null,null,null,null,null,null,null,null,null,null,"Equity Payment - Corporate",6.9346072641296219,0]
[null,null,"   Day Vessel workers",{"$f":"DefaultData!Z45","v":80.000000000000043},{"$f":"DefaultData!AA45","v":64.219119251483306},{"$f":"DefaultData!AB45","v":15.780880748516738},null,{"$f":"(Y19*10^6)/(D32*(52*40))","v":2.5156042890774923},null,null,null,null,null,null,null,null,null,null,null,null,null,null,null,null,null,null,null,"Property Taxes",0,1]
[null,null,"  O&M Labor",null,null,null,null,null,null,null,null,null,null,null,null,null,null,null,null,null,null,null,null,null,null,null,null,"Lease Cost",0,1]
[null,null,"   All workers",{"$f":"DefaultData!Z55","v":38.461538461538446},{"$f":"DefaultData!AA55","v":30.8745765632131},{"$f":"DefaultData!AB55","v":7.586961898325348},null,{"$f":"(G66*10^6)/(D34*(52*40))","v":9.5000000000000036},null,null,null,null,null,null,null,null,null,null,null,null,null,null,null,null,null,null,null,"Total",11.707464343675078]
[]
[null,null,null,null,null,null,null,"Eng.& Prof. Svcs.",{"$f":"I56","v":14.108652855118253},null,null,"Eng. & Prof. Svcs.",{"$f":"(M56)*$G61","v":0.75868947311665258},{"$f":"M46-H46","v":0.13377754373536976},null,"Eng. & Prof. Svcs.",{"$f":"(Q56)*$G61","v":1.9331292330301986},{"$f":"(Q58-Q36-Q46)*G61","v":11.2015005084011},null,null,{"$f":"(U56)*$G61","v":1.2268791184605405},{"$f":"(U58-U36-U46)*G61","v":4.9624046415034133},null,null,null,null,null,"Other Parameters"]
[null,null,null,null,null,null,null,"Other Sectors (not Construction)",{"$f":"I58-I46-I38-I36","v":15.067450417018547},null,null,"Other Sectors (not Construction)",{"$f":"((M58-M46)*G61)-M38-M36","v":1.3117777753367972},null,null,"Other Sectors (not Construction)",{"$f":"((Q58-Q46)*G61)-Q38-Q36","v":3.8801089063477052},null,null,null,{"$f":"((U58-U46)*G61)-U38-U36","v":2.5431826422907386},null,null,null,null,null,null,null,null,"Local Share"]
[null,null,null,null,null,null,null,"Manufacturing Jobs",{"$f":"I47+I48+I49+I50","v":24.859069093820594},null,null,"Mfg W&S Earnings",{"$f":"(M47+M48+M49+M50)*$G61","v":1.6440691824156877},{"$f":"(N47+N48+N49+N50)*$G61","v":1.1280516685692701},null,"Mfg Output",{"$f":"(Q47+Q48+Q49+Q50)*$G61","v":7.1710985149516278},{"$f":"(R47+R48+R49+R50)*$G61","v":3.898420028046869},null,null,{"$f":"(U47+U48+U49+U50)*$G61","v":2.3238370414646128},{"$f":"(V47+V48+V49+V50)*$G61","v":1.9988241645021882},null,null,null,null,null,"Financial Parameters"]
[null,null,null,null,null,null,null,null,null,null,null,null,null,null,null,null,null,null,null,null,null,null,null,null,null,null,null,{"$f":"DefaultData!C43","v":"Debt Financing"},null,null,null,null,"Local Economic Impacts - Summary Results"]
[null,null,"Year",{"$f":"+ProjectData!B21","v":2009},null,{"$f":"CONCATENATE(\"Convert to \",Deflators!E4, \" dollars\")","v":"Convert to 2014 dollars"},{"$f":"Deflators!F7","v":1.0843},null,null,null,null,null,{"$f":"M47+M48+M49+M50","v":1.7826642144933302},null,null,null,null,null,null,null,null,null,null,null,null,null,null,{"$f":"DefaultData!C44","v":"  Percentage financed"},{"$f":"IF(ProjectData!$B$24=\"y\",DefaultData!D44,ProjectData!B59)","v":0.2},{"$f":"IF(ProjectData!$B$24=\"y\",DefaultData!F44,ProjectData!D59)","v":0},null,null,null,"Jobs","Earnings","Output","Value Added"]
[null,null,"Installation Costs Local Demand - margined",null,null,null,null,null,null,null,null,null,{"$f":"Deflators!E4","v":2014},"Dollars",null,null,null,null,null,null,null,null,null,null,null,null,null,{"$f":"DefaultData!C45","v":"  Years financed (term)"},{"$f":"IF(ProjectData!$B$24=\"y\",DefaultData!D45,ProjectData!B60)","v":20},null,null,null,"During construction and installation period"]
[null,null,null,"Demand",null,"Total","Adj Demand",null,"Jobs","Jobs","Jobs","Jobs","Earnings",null,null,null,"Output",null,null,null,"Value Added",null,null,null,null,null,null,{"$f":"DefaultData!C46","v":"  Interest rate"},{"$f":"IF(ProjectData!$B$24=\"y\",DefaultData!D46,ProjectData!B61)","v":0.1},null,null,null,"     Project Development and Onsite Labor Impacts",{"$f":"AH43+AH44","v":18.875566974776188},{"$f":"AI43+AI44","v":1.3006629001340695},{"$f":"AJ43+AJ44","v":2.7441600558287824},{"$f":"AK43+AK44","v":1.8173729083127097}]
[null,null,null,null,null,null,null,null,"Direct","Indirect","Induced","Total","Direct","Indirect","Induced","Total","Direct","Indirect","Induced","Total","Direct","Indirect","Induced","Total",null,null,null,{"$f":"DefaultData!C54","v":"Tax Parameters"},null,null,null,null,"       Construction and Installation Labor",{"$f":"I46","v":4.766914119657935},{"$f":"M46*G61","v":0.5419734270174168},{"$f":"Q46*G61","v":0.81103082279858363},{"$f":"U46*G61","v":0.59049378985216916}]
[null,null,"Agriculture",{"$f":"$E$130*DefaultData!D83+$E$131*DefaultData!D84+$E$132*DefaultData!D85+$E$133*DefaultData!D86+$E$134*DefaultData!D87+$E$135*DefaultData!D88+$E$136*DefaultData!D89+$E$137*DefaultData!D90+$E$138*DefaultData!D91+$E$139*DefaultData!D92+$E$140*DefaultData!D93+$E$141*DefaultData!D94+$E$142*DefaultData!D95+$E$143*DefaultData!D96","v":0},null,{"$f":"D44","v":0},{"$f":"F44*G$40","v":0},null,{"$f":"+G44*Multipliers!D213","v":0},{"$f":"+$G44*Multipliers!E213","v":0},{"$f":"+$G44*Multipliers!F213","v":0},{"$f":"+K44+J44+I44","v":0},{"$f":"+$G44*Multipliers!H213","v":0},{"$f":"+$G44*Multipliers!I213","v":0},{"$f":"+$G44*Multipliers!J213","v":0},{"$f":"+O44+N44+M44","v":0},{"$f":"+$G44*Multipliers!L213","v":0},{"$f":"+$G44*Multipliers!M213","v":0},{"$f":"+$G44*Multipliers!N213","v":0},{"$f":"+S44+R44+Q44","v":0},{"$f":"+$G44*Multipliers!P213","v":0},{"$f":"+$G44*Multipliers!Q213","v":0},{"$f":"+$G44*Multipliers!R213","v":0},{"$f":"+W44+V44+U44","v":0},null,null,null,{"$f":"DefaultData!C55","v":"  Local Property Tax (percent of taxable value)"},{"$f":"IF(ProjectData!$B$24=\"y\",DefaultData!D55,ProjectData!B69)","v":0},null,null,null,"       Construction and Installation Related Services",{"$f":"I36","v":14.108652855118253},{"$f":"M36","v":0.75868947311665258},{"$f":"Q36","v":1.9331292330301986},{"$f":"U36","v":1.2268791184605405}]
[null,null,"Mining",{"$f":"$E$130*DefaultData!E83+$E$131*DefaultData!E84+$E$132*DefaultData!E85+$E$133*DefaultData!E86+$E$134*DefaultData!E87+$E$135*DefaultData!E88+$E$136*DefaultData!E89+$E$137*DefaultData!E90+$E$138*DefaultData!E91+$E$139*DefaultData!E92+$E$140*DefaultData!E93+$E$141*DefaultData!E94+$E$142*DefaultData!E95+$E$143*DefaultData!E96","v":0},null,{"$f":"D45","v":0},{"$f":"F45*G$40","v":0},null,{"$f":"+G45*Multipliers!D214","v":0},{"$f":"+$G45*Multipliers!E214","v":0},{"$f":"+$G45*Multipliers!F214","v":0},{"$f":"+K45+J45+I45","v":0},{"$f":"+$G45*Multipliers!H214","v":0},{"$f":"+$G45*Multipliers!I214","v":0},{"$f":"+$G45*Multipliers!J214","v":0},{"$f":"+O45+N45+M45","v":0},{"$f":"+$G45*Multipliers!L214","v":0},{"$f":"+$G45*Multipliers!M214","v":0},{"$f":"+$G45*Multipliers!N214","v":0},{"$f":"+S45+R45+Q45","v":0},{"$f":"+$G45*Multipliers!P214","v":0},{"$f":"+$G45*Multipliers!Q214","v":0},{"$f":"+$G45*Multipliers!R214","v":0},{"$f":"+W45+V45+U45","v":0},null,null,null,{"$f":"DefaultData!C56","v":"  Assessed Value (percent of construction cost)"},{"$f":"IF(ProjectData!$B$24=\"y\",DefaultData!D56,ProjectData!B70)","v":1},null,null,null,"     Equipment and Supply Chain Impacts",{"$f":"I37+I38+J58","v":74.86329176825825},{"$f":"((M37+M38+N61))","v":5.214560813683387},{"$f":"+((Q37+Q38+R61))","v":18.161499536661751},{"$f":"+((U37+U38+V61))","v":8.8136977819318787}]
[null,null,"Construction",{"$f":"$E$130*DefaultData!F83+$E$131*DefaultData!F84+$E$132*DefaultData!F85+$E$133*DefaultData!F86+$E$134*DefaultData!F87+$E$135*DefaultData!F88+$E$136*DefaultData!F89+$E$137*DefaultData!F90+$E$138*DefaultData!F91+$E$139*DefaultData!F92+$E$140*DefaultData!F93+$E$141*DefaultData!F94+$E$142*DefaultData!F95+$E$143*DefaultData!F96","v":0.81103082279858363},null,0.81103082279858363,0.87940072116050427,{"$f":"Y19*G40","v":0.45388424317961529},{"$f":"(H47*Multipliers!D215)+H32","v":4.766914119657935},{"$f":"+$G46*Multipliers!E215","v":2.5819846615721422},{"$f":"+$G46*Multipliers!F215","v":2.3233207186151348},9.6722194998452125,{"$f":"H46 +($H47*Multipliers!H215)","v":0.58766178691498505},{"$f":"+$G46*Multipliers!I215","v":0.15454656730289448},{"$f":"+$G46*Multipliers!J215","v":0.13782665022083745},0.88003500443871696,{"$f":"+$G46*Multipliers!L215","v":0.87940072116050427},{"$f":"+$G46*Multipliers!M215","v":0.46576974583884445},{"$f":"+$G46*Multipliers!N215","v":0.38804785670529263},1.7332183237046412,{"$f":"H46+$H47*Multipliers!P215","v":0.64027241633670706},{"$f":"+$G46*Multipliers!Q215","v":0.26622417249047953},{"$f":"+$G46*Multipliers!R215","v":0.23830047960348602},1.1447970684306727,null,null,null,{"$f":"DefaultData!C57","v":"  Taxable Value (percent of assessed value)"},{"$f":"IF(ProjectData!$B$24=\"y\",DefaultData!D57,ProjectData!B71)","v":1},null,null,null,"     Induced Impacts",{"$f":"K58","v":48.663905579860803},{"$f":"O61","v":2.8143489196916627},{"$f":"S61","v":7.9253821180437969},{"$f":"W61","v":4.8666208820000492}]
[null,null,"Manufacturing",{"$f":"$E$130*DefaultData!G83+$E$131*DefaultData!G84+$E$132*DefaultData!G85+$E$133*DefaultData!G86+$E$134*DefaultData!G87+$E$135*DefaultData!G88+$E$136*DefaultData!G89+$E$137*DefaultData!G90+$E$138*DefaultData!G91+$E$139*DefaultData!G92+$E$140*DefaultData!G93+$E$141*DefaultData!G94+$E$142*DefaultData!G95+$E$143*DefaultData!G96","v":2.901413667186183},null,2.901413667186183,3.1460028393299782,{"$f":"G46-H46","v":0.42551647798088899},{"$f":"+G47*Multipliers!D216","v":5.5849296765951397},{"$f":"+$G47*Multipliers!E216","v":6.7404848809105635},{"$f":"+$G47*Multipliers!F216","v":5.5735954976438009},17.899010055149503,{"$f":"+$G47*Multipliers!H216","v":0.53541566530710549},{"$f":"+$G47*Multipliers!I216","v":0.48939619185475824},{"$f":"+$G47*Multipliers!J216","v":0.32961210007433328},1.3544239572361971,{"$f":"+$G47*Multipliers!L216","v":3.1460028393299782},{"$f":"+$G47*Multipliers!M216","v":1.6815010233463195},{"$f":"+$G47*Multipliers!N216","v":0.92818808784549334},5.7556919505217907,{"$f":"+$G47*Multipliers!P216","v":0.98484541251081303},{"$f":"+$G47*Multipliers!Q216","v":0.89137374669173475},{"$f":"+$G47*Multipliers!R216","v":0.56996307404338975},2.4461822332459375,null,null,null,{"$f":"DefaultData!C58","v":"  Taxable Value ( million$ - if applicable)"},{"$f":"IF(ProjectData!$B$24=\"y\",DefaultData!D58,ProjectData!B72)","v":52.896999999999991},null,null,null,"     Total Impacts (Direct, Indirect, Induced)",{"$f":"AH46+AH45+AH42","v":142.40276432289522},{"$f":"AI46+AI45+AI42","v":9.3295726335091196},{"$f":"AJ46+AJ45+AJ42","v":28.831041710534329},{"$f":"AK46+AK45+AK42","v":15.497691572244637}]
[null,null,"Fabricated Metals",{"$f":"$E$130*DefaultData!H83+$E$131*DefaultData!H84+$E$132*DefaultData!H85+$E$133*DefaultData!H86+$E$134*DefaultData!H87+$E$135*DefaultData!H88+$E$136*DefaultData!H89+$E$137*DefaultData!H90+$E$138*DefaultData!H91+$E$139*DefaultData!H92+$E$140*DefaultData!H93+$E$141*DefaultData!H94+$E$142*DefaultData!H95+$E$143*DefaultData!H96","v":4.2696848477654452},null,4.2696848477654452,4.6296192804320722,null,{"$f":"+G48*Multipliers!D217","v":19.274139417225456},{"$f":"+$G48*Multipliers!E217","v":10.330883096001605},{"$f":"+$G48*Multipliers!F217","v":10.954780736295113},40.559803249522176,{"$f":"+$G48*Multipliers!H217","v":1.2472485491862249},{"$f":"+$G48*Multipliers!I217","v":0.73375023237490133},{"$f":"+$G48*Multipliers!J217","v":0.63789907219848219},2.6188978537596084,{"$f":"+$G48*Multipliers!L217","v":4.6296192804320722},{"$f":"+$G48*Multipliers!M217","v":2.5455558130649005},{"$f":"+$G48*Multipliers!N217","v":1.7963996770995549},8.9715747705965274,{"$f":"+$G48*Multipliers!P217","v":1.5348910915492668},{"$f":"+$G48*Multipliers!Q217","v":1.2759512948779881},{"$f":"+$G48*Multipliers!R217","v":1.1030803438744927},3.9139227303017474,null,null,null,{"$f":"DefaultData!C59","v":"  Property Tax Exemption (percent of local taxes)"},{"$f":"IF(ProjectData!$B$24=\"y\",DefaultData!D59,ProjectData!B73)","v":1}]
[null,null,"Machinery",{"$f":"$E$130*DefaultData!I83+$E$131*DefaultData!I84+$E$132*DefaultData!I85+$E$133*DefaultData!I86+$E$134*DefaultData!I87+$E$135*DefaultData!I88+$E$136*DefaultData!I89+$E$137*DefaultData!I90+$E$138*DefaultData!I91+$E$139*DefaultData!I92+$E$140*DefaultData!I93+$E$141*DefaultData!I94+$E$142*DefaultData!I95+$E$143*DefaultData!I96","v":0},null,0,0,null,{"$f":"+G49*Multipliers!D218","v":0},{"$f":"+$G49*Multipliers!E218","v":0},{"$f":"+$G49*Multipliers!F218","v":0},0,{"$f":"+$G49*Multipliers!H218","v":0},{"$f":"+$G49*Multipliers!I218","v":0},{"$f":"+$G49*Multipliers!J218","v":0},0,{"$f":"+$G49*Multipliers!L218","v":0},{"$f":"+$G49*Multipliers!M218","v":0},{"$f":"+$G49*Multipliers!N218","v":0},0,{"$f":"+$G49*Multipliers!P218","v":0},{"$f":"+$G49*Multipliers!Q218","v":0},{"$f":"+$G49*Multipliers!R218","v":0},0,null,null,null,{"$f":"DefaultData!C60","v":"  Local Property Taxes"},{"$f":"IF(ProjectData!$B$24=\"y\",DefaultData!D60,ProjectData!B74)","v":0},{"$f":"IF(ProjectData!$B$24=\"y\",DefaultData!F60,ProjectData!D74)","v":1},null,null,"  During operating years (annual)"]
[null,null,"Electrical Equipment",{"$f":"$E$130*DefaultData!J83+$E$131*DefaultData!J84+$E$132*DefaultData!J85+$E$133*DefaultData!J86+$E$134*DefaultData!J87+$E$135*DefaultData!J88+$E$136*DefaultData!J89+$E$137*DefaultData!J90+$E$138*DefaultData!J91+$E$139*DefaultData!J92+$E$140*DefaultData!J93+$E$141*DefaultData!J94+$E$142*DefaultData!J95+$E$143*DefaultData!J96","v":0},null,0,0,null,{"$f":"+G50*Multipliers!D219","v":0},{"$f":"+$G50*Multipliers!E219","v":0},{"$f":"+$G50*Multipliers!F219","v":0},0,{"$f":"+$G50*Multipliers!H219","v":0},{"$f":"+$G50*Multipliers!I219","v":0},{"$f":"+$G50*Multipliers!J219","v":0},0,{"$f":"+$G50*Multipliers!L219","v":0},{"$f":"+$G50*Multipliers!M219","v":0},{"$f":"+$G50*Multipliers!N219","v":0},0,{"$f":"+$G50*Multipliers!P219","v":0},{"$f":"+$G50*Multipliers!Q219","v":0},{"$f":"+$G50*Multipliers!R219","v":0},0,null,null,null,{"$f":"DefaultData!C61","v":"  Local Sales Tax Rate"},{"$f":"IF(ProjectData!$B$24=\"y\",DefaultData!D61,ProjectData!B75)","v":7.4999999999999997E-2},{"$f":"IF(ProjectData!$B$24=\"y\",DefaultData!G38,ProjectData!E44)","v":1},null,null,"   Onsite Labor Impacts"]
[null,null,"TCPU",{"$f":"$E$130*DefaultData!K83+$E$131*DefaultData!K84+$E$132*DefaultData!K85+$E$133*DefaultData!K86+$E$134*DefaultData!K87+$E$135*DefaultData!K88+$E$136*DefaultData!K89+$E$137*DefaultData!K90+$E$138*DefaultData!K91+$E$139*DefaultData!K92+$E$140*DefaultData!K93+$E$141*DefaultData!K94+$E$142*DefaultData!K95+$E$143*DefaultData!K96","v":0.13008705289078676},null,0.13008705289078676,0.14105339144948009,null,{"$f":"+G51*Multipliers!D220","v":0.45175692918381205},{"$f":"+$G51*Multipliers!E220","v":0.32701556693287764},{"$f":"+$G51*Multipliers!F220","v":0.32887504703480558},1.1076475431514954,{"$f":"+$G51*Multipliers!H220","v":3.765259441052151E-2},{"$f":"+$G51*Multipliers!I220","v":2.261353032441852E-2},{"$f":"+$G51*Multipliers!J220","v":1.9309138430783003E-2},7.9575263165723026E-2,{"$f":"+$G51*Multipliers!L220","v":0.14105339144948009},{"$f":"+$G51*Multipliers!M220","v":7.0722151826897728E-2},{"$f":"+$G51*Multipliers!N220","v":5.436762226866592E-2},0.26614316554504375,{"$f":"+$G51*Multipliers!P220","v":6.153887622190831E-2},{"$f":"+$G51*Multipliers!Q220","v":3.9661396013785807E-2},{"$f":"+$G51*Multipliers!R220","v":3.3386505191117764E-2},0.13458677742681188,null,null,null,{"$f":"DefaultData!C62","v":"Lease Cost (if applicable)"},{"$f":"IF(ProjectData!$B$24=\"y\",DefaultData!D62,ProjectData!B76)","v":0},{"$f":"IF(ProjectData!$B$24=\"y\",DefaultData!F62,ProjectData!D76)","v":1},null,null,"     Hydro Project Labor Only",{"$f":"L126","v":9.5000000000000036},{"$f":"P128","v":0.70589792140927166},{"$f":"T128","v":0.70589792140927166},{"$f":"X128","v":0.70589792140927166}]
[null,null,"Wholesale Trade",{"$f":"$E$130*DefaultData!L83+$E$131*DefaultData!L84+$E$132*DefaultData!L85+$E$133*DefaultData!L86+$E$134*DefaultData!L87+$E$135*DefaultData!L88+$E$136*DefaultData!L89+$E$137*DefaultData!L90+$E$138*DefaultData!L91+$E$139*DefaultData!L92+$E$140*DefaultData!L93+$E$141*DefaultData!L94+$E$142*DefaultData!L95+$E$143*DefaultData!L96","v":3.5356236631542721},null,3.5356236631542721,3.8336767379581773,null,{"$f":"+G52*Multipliers!D221","v":12.940179716983113},{"$f":"+$G52*Multipliers!E221","v":7.9574061105899494},{"$f":"+$G52*Multipliers!F221","v":9.004772679282036},29.902358506855098,{"$f":"+$G52*Multipliers!H221","v":1.2700894116264547},{"$f":"+$G52*Multipliers!I221","v":0.5743655617138913},{"$f":"+$G52*Multipliers!J221","v":0.59294746919439278},2.4374024425347387,{"$f":"+$G52*Multipliers!L221","v":3.8336767379581773},{"$f":"+$G52*Multipliers!M221","v":1.5793415994867013},{"$f":"+$G52*Multipliers!N221","v":1.6697215872017521},7.0827399246466314,{"$f":"+$G52*Multipliers!P221","v":2.5384561245091213},{"$f":"+$G52*Multipliers!Q221","v":0.98804416446512933},{"$f":"+$G52*Multipliers!R221","v":1.0253132059510712},4.5518134949253213,null,null,null,null,null,null,null,null,"   Local Revenue and Supply Chain Impacts",{"$f":"(L148-AH51)+M148","v":9.7117761729363963},{"$f":"((P149+Q149))-AI51","v":0.66566439710435221},{"$f":"((T149+U149))-AJ51","v":2.3919073893933409},{"$f":"((X149+Y149))-AK51","v":1.3194701641672357}]
[null,null,"Retail Trade",{"$f":"$E$130*DefaultData!M83+$E$131*DefaultData!M84+$E$132*DefaultData!M85+$E$133*DefaultData!M86+$E$134*DefaultData!M87+$E$135*DefaultData!M88+$E$136*DefaultData!M89+$E$137*DefaultData!M90+$E$138*DefaultData!M91+$E$139*DefaultData!M92+$E$140*DefaultData!M93+$E$141*DefaultData!M94+$E$142*DefaultData!M95+$E$143*DefaultData!M96","v":8.945063810598998E-2},null,8.945063810598998E-2,9.6991326898324945E-2,null,{"$f":"+G53*Multipliers!D222","v":0.99358217966366036},{"$f":"+$G53*Multipliers!E222","v":0.18586413327975987},{"$f":"+$G53*Multipliers!F222","v":0.27889906660155889},1.458345379544979,{"$f":"+$G53*Multipliers!H222","v":4.0547547093092884E-2},{"$f":"+$G53*Multipliers!I222","v":1.1811449927813808E-2},{"$f":"+$G53*Multipliers!J222","v":1.679244282933566E-2},6.9151439850242358E-2,{"$f":"+$G53*Multipliers!L222","v":9.6991326898324945E-2},{"$f":"+$G53*Multipliers!M222","v":3.4227964505951607E-2},{"$f":"+$G53*Multipliers!N222","v":4.7283379970131469E-2},0.17850267137440801,{"$f":"+$G53*Multipliers!P222","v":6.8464381029206045E-2},{"$f":"+$G53*Multipliers!Q222","v":2.1293393522404731E-2},{"$f":"+$G53*Multipliers!R222","v":2.9035737654895196E-2},0.11879351220650597,null,null,null,null,null,null,null,null,"     Induced Impacts",{"$f":"N148","v":5.8741967002838411},{"$f":"R149","v":0.33926860732866782},{"$f":"V149","v":0.95532063396396061},{"$f":"Z149","v":0.58663727606844451}]
[null,null,"FIRE",{"$f":"$E$130*DefaultData!N83+$E$131*DefaultData!N84+$E$132*DefaultData!N85+$E$133*DefaultData!N86+$E$134*DefaultData!N87+$E$135*DefaultData!N88+$E$136*DefaultData!N89+$E$137*DefaultData!N90+$E$138*DefaultData!N91+$E$139*DefaultData!N92+$E$140*DefaultData!N93+$E$141*DefaultData!N94+$E$142*DefaultData!N95+$E$143*DefaultData!N96","v":0},null,0,0,null,{"$f":"+G54*Multipliers!D223","v":0},{"$f":"+$G54*Multipliers!E223","v":0},{"$f":"+$G54*Multipliers!F223","v":0},0,{"$f":"+$G54*Multipliers!H223","v":0},{"$f":"+$G54*Multipliers!I223","v":0},{"$f":"+$G54*Multipliers!J223","v":0},0,{"$f":"+$G54*Multipliers!L223","v":0},{"$f":"+$G54*Multipliers!M223","v":0},{"$f":"+$G54*Multipliers!N223","v":0},0,{"$f":"+$G54*Multipliers!P223","v":0},{"$f":"+$G54*Multipliers!Q223","v":0},{"$f":"+$G54*Multipliers!R223","v":0},0,null,null,null,null,null,null,null,null,"     Total Impacts (Direct, Indirect, Induced)",{"$f":"SUM(AH51:AH53)","v":25.085972873220243},{"$f":"SUM(AI51:AI53)","v":1.7108309258422918},{"$f":"SUM(AJ51:AJ53)","v":4.0531259447665731},{"$f":"SUM(AK51:AK53)","v":2.6120053616449521}]
[null,null,"Misc. Services",{"$f":"$E$130*DefaultData!O83+$E$131*DefaultData!O84+$E$132*DefaultData!O85+$E$133*DefaultData!O86+$E$134*DefaultData!O87+$E$135*DefaultData!O88+$E$136*DefaultData!O89+$E$137*DefaultData!O90+$E$138*DefaultData!O91+$E$139*DefaultData!O92+$E$140*DefaultData!O93+$E$141*DefaultData!O94+$E$142*DefaultData!O95+$E$143*DefaultData!O96","v":0.12494755219665767},null,0.12494755219665767,0.13548063084683593,null,{"$f":"+G55*Multipliers!D224","v":0.68193159118795721},{"$f":"+$G55*Multipliers!E224","v":0.28851137115663722},{"$f":"+$G55*Multipliers!F224","v":0.47467156996235405},1.4451145323069485,{"$f":"+$G55*Multipliers!H224","v":7.4071088667619744E-2},{"$f":"+$G55*Multipliers!I224","v":2.2341824640687968E-2},{"$f":"+$G55*Multipliers!J224","v":3.0933676868868481E-2},0.1273465901771762,{"$f":"+$G55*Multipliers!L224","v":0.13548063084683593},{"$f":"+$G55*Multipliers!M224","v":5.7495214188780418E-2},{"$f":"+$G55*Multipliers!N224","v":8.7102765379945116E-2},0.28007861041556148,{"$f":"+$G55*Multipliers!P224","v":8.9113557275611668E-2},{"$f":"+$G55*Multipliers!Q224","v":3.6296147940377915E-2},{"$f":"+$G55*Multipliers!R224","v":5.3487737902654937E-2},0.17889744311864453]
[null,null,"Professional Services",{"$f":"$E$130*DefaultData!P83+$E$131*DefaultData!P84+$E$132*DefaultData!P85+$E$133*DefaultData!P86+$E$134*DefaultData!P87+$E$135*DefaultData!P88+$E$136*DefaultData!P89+$E$137*DefaultData!P90+$E$138*DefaultData!P91+$E$139*DefaultData!P92+$E$140*DefaultData!P93+$E$141*DefaultData!P94+$E$142*DefaultData!P95+$E$143*DefaultData!P96","v":1.9331292330301986},null,1.9331292330301986,2.0960920273746444,null,{"$f":"+G56*Multipliers!D225","v":14.108652855118253},{"$f":"+$G56*Multipliers!E225","v":4.7458914416257194},{"$f":"+$G56*Multipliers!F225","v":6.0605886056500147},24.915132902393985,{"$f":"+$G56*Multipliers!H225","v":0.82264699570038646},{"$f":"+$G56*Multipliers!I225","v":0.30778092078848068},{"$f":"+$G56*Multipliers!J225","v":0.36273110178543627},1.4931590182743033,{"$f":"+$G56*Multipliers!L225","v":2.0960920273746444},{"$f":"+$G56*Multipliers!M225","v":0.88407368284341858},{"$f":"+$G56*Multipliers!N225","v":1.0213765626600786},4.001542272878142,{"$f":"+$G56*Multipliers!P225","v":1.3303050281467641},{"$f":"+$G56*Multipliers!Q225","v":0.53785963480027288},{"$f":"+$G56*Multipliers!R225","v":0.62720270490962671},2.4953673678566637]
[null,null,"Government",{"$f":"$E$130*DefaultData!Q83+$E$131*DefaultData!Q84+$E$132*DefaultData!Q85+$E$133*DefaultData!Q86+$E$134*DefaultData!Q87+$E$135*DefaultData!Q88+$E$136*DefaultData!Q89+$E$137*DefaultData!Q90+$E$138*DefaultData!Q91+$E$139*DefaultData!Q92+$E$140*DefaultData!Q93+$E$141*DefaultData!Q94+$E$142*DefaultData!Q95+$E$143*DefaultData!Q96","v":3.3903966244287487},null,3.3903966244287487,3.6762070598680925,null,0,{"$f":"+$G57*Multipliers!E226","v":1.7787309953498418},{"$f":"+$G57*Multipliers!F226","v":13.664401658775985},15.443132654125826,0,{"$f":"+$G57*Multipliers!I226","v":0.13251715505803083},{"$f":"+$G57*Multipliers!J226","v":0.92354688201920054},1.0560640370772314,0,{"$f":"+$G57*Multipliers!M226","v":0.39100254558565739},{"$f":"+$G57*Multipliers!N226","v":2.6010042914639762},2.9920068370496335,0,{"$f":"+$G57*Multipliers!Q226","v":0.22267911105063412},{"$f":"+$G57*Multipliers!R226","v":1.5971072332219194},1.8197863442725535]
[null,null,"Total",{"$f":"SUM(D44:D57)","v":17.185764101556867},null,{"$f":"SUM(F44:F57)","v":17.185764101556867},{"$f":"SUM(G44:G57)","v":18.634524015318107},null,{"$f":"SUM(I44:I57)","v":58.802086485615327},34.936772257419101,48.663905579860803,142.40276432289522,4.6153336389063915,2.4491234339858776,3.0515985336216698,10.116055606513937,14.958316955450016,7.7096897406874714,8.5934918305948891,31.261498526732378,{"$f":"SUM(U44:U57)","v":7.2478868875793987},4.2793830618528075,5.2768770223526538,16.80414697178486]
[]
[null,null,null,null,null,"Inflator to",{"$f":"D40","v":2009},"Dollars"]
[null,null,null,null,null,null,{"$f":"Deflators!F8","v":0.92225398874850129},null,null,null,null,null,{"$f":"M58*$G61","v":4.256509857886555},2.2587138559309023,2.8143489196916627,9.3295726335091178,13.795367477128115,7.1102921153624195,7.9253821180437969,28.831041710534333,{"$f":"U58*$G61","v":6.6843925920680611},3.9466780981765259,4.8666208820000492,15.497691572244635]
[]
[null,null,{"$f":"DefaultData!C33","v":"Annualized Operating and Maintenance Costs"}]
[null,null,null,"Cost","Local Share",null,"Local $ Spending"]
[]
[null,null,{"$f":"DefaultData!C35","v":"Labor"},{"$f":"IF(ProjectData!$B$24=\"y\",DefaultData!D35,ProjectData!B50)","v":0.76},{"$f":"IF(ProjectData!$B$24=\"y\",ProjectData!T$50,ProjectData!E$50)","v":1},null,{"$f":"D66*E66","v":0.76}]
[null,null,{"$f":"DefaultData!C36","v":"Materials and Services"},{"$f":"IF(ProjectData!$B$24=\"y\",DefaultData!D36,ProjectData!B51)","v":2.8455550000000001},{"$f":"IF(ProjectData!$B$24=\"y\",ProjectData!T$51,ProjectData!E$51)","v":0.5},null,{"$f":"D67*E67","v":1.4227775}]
[null,null,{"$f":"DefaultData!C37","v":"Subtotal"},{"$f":"D66+D67","v":3.6055549999999998},null,null,{"$f":"G66+G67","v":2.1827775000000003}]
[null,null,{"$f":"DefaultData!C38","v":"Sales Tax (Materials & Equipment Purchases)"},{"$f":"IF(ProjectData!$B$24=\"y\",DefaultData!D38,ProjectData!B53)","v":0.13581057954545456},{"$f":"IF(ProjectData!$B$24=\"y\",ProjectData!T53,ProjectData!E53)","v":1},null,{"$f":"D69*E69","v":0.13581057954545456}]
[null,null,"Average Annual Debt Payment (Interest and Principal)",{"$f":"IF(ProjectData!$B$24=\"y\",F186,Calculations!F222)","v":1.0314915},{"$f":"IF(ProjectData!$B$24=\"y\",DefaultData!F44,ProjectData!D59)","v":0},null,0,{"$f":"IF(ProjectData!$B$24=\"y\",Calculations!D186,D222)*E70","v":0},"Debt Pmt - Local share Avg Ann Interest"]
[null,null,"Equity Payment - Individuals",{"$f":"IF(ProjectData!$B$24=\"y\",K186,Calculations!K223)","v":0},{"$f":"IF(ProjectData!$B$24=\"y\",DefaultData!F45,ProjectData!D60)","v":0},null,0,{"$f":"IF(ProjectData!$B$24=\"y\",Calculations!I186,I222)*E71","v":0},"Debt Pmt - Local share Avg Ann Interest"]
[null,null,"Equity Payment - Corporate",{"$f":"IF(ProjectData!$B$24=\"y\",P186,Calculations!P222)","v":6.9346072641296219},{"$f":"IF(ProjectData!$B$24=\"y\",DefaultData!F46,ProjectData!D61)","v":0},null,0,{"$f":"IF(ProjectData!$B$24=\"y\",Calculations!N186,N222)*E72","v":0},"Debt Pmt - Local share Avg Ann Interest"]
[null,null,"Property Taxes",{"$f":"IF(ProjectData!$B$24=\"y\",DefaultData!D60,ProjectData!B74)","v":0},{"$f":"IF(ProjectData!$B$24=\"y\",DefaultData!F60,ProjectData!D74)","v":1},null,0]
[null,null,"Lease Cost",{"$f":"IF(ProjectData!$B$24=\"y\",DefaultData!D62,ProjectData!B76)","v":0},{"$f":"IF(ProjectData!$B$24=\"y\",DefaultData!F62,ProjectData!D76)","v":1},null,0]
[null,null,"Total",{"$f":"SUM(D68:D74)","v":11.707464343675078},null,null,{"$f":"SUM(G68:G74)","v":2.3185880795454548}]
[null,null,"Total (without debt, equity, or property taxes)",{"$f":"D68","v":3.6055549999999998},{"$f":"D75-D76","v":8.1019093436750786},null,{"$f":"G68","v":2.1827775000000003},{"$f":"G75-G76","v":0.1358105795454545}]
[null,null,"Total cost per KW",{"$f":"D76/(ProjectData!B17*1000)","v":3.6055549999999999E-4}]
[]
[]
[]
[]
[]
[null,null,null,null,null,null,null,null,null,null,null,"Without Plant Employees"]
[null,null,"Annual Operations and Maintenance Costs Local Demand - margined",null,null,null,null,null,null,null,null,null,null,null,{"$f":"M41","v":2014},{"$f":"N41","v":"Dollars"}]
[null,null,null,"Demand",null,null,"Total","Adj Demand - Million",null,null,null,"Jobs",null,null,null,"Earnings",null,null,null,"Output",null,null,null,"Value Added"]
[null,null,null,null,null,null,null,{"$f":"M41","v":2014},"Dollars",null,null,"Direct","Indirect","Induced","Total","Direct","Indirect","Induced","Total","Direct","Indirect","Induced","Total","Direct","Indirect","Induced","Total"]
[null,null,"Agriculture",{"$f":"$D$130*DefaultData!D83+$D$131*DefaultData!D84+$D$132*DefaultData!D85+$D$133*DefaultData!D86+$D$134*DefaultData!D87+$D$135*DefaultData!D88+$D$136*DefaultData!D89+$D$137*DefaultData!D90+$D$138*DefaultData!D91+$D$139*DefaultData!D92+$D$140*DefaultData!D93+$D$141*DefaultData!D94+$D$142*DefaultData!D95+$D$143*DefaultData!D96","v":0},null,null,{"$f":"F87+E87+D87","v":0},{"$f":"G87*G$40","v":0},null,null,null,{"$f":"$H87*Multipliers!D213","v":0},{"$f":"$H87*Multipliers!E213","v":0},{"$f":"$H87*Multipliers!F213","v":0},{"$f":"+N87+M87+L87","v":0},{"$f":"$H87*Multipliers!H213","v":0},{"$f":"$H87*Multipliers!I213","v":0},{"$f":"$H87*Multipliers!J213","v":0},{"$f":"+R87+Q87+P87","v":0},{"$f":"$H87*Multipliers!L213","v":0},{"$f":"$H87*Multipliers!M213","v":0},{"$f":"$H87*Multipliers!N213","v":0},{"$f":"+V87+U87+T87","v":0},{"$f":"$H87*Multipliers!P213","v":0},{"$f":"$H87*Multipliers!Q213","v":0},{"$f":"$H87*Multipliers!R213","v":0},{"$f":"+Z87+Y87+X87","v":0}]
[null,null,"Mining",{"$f":"$D$130*DefaultData!E83+$D$131*DefaultData!E84+$D$132*DefaultData!E85+$D$133*DefaultData!E86+$D$134*DefaultData!E87+$D$135*DefaultData!E88+$D$136*DefaultData!E89+$D$137*DefaultData!E90+$D$138*DefaultData!E91+$D$139*DefaultData!E92+$D$140*DefaultData!E93+$D$141*DefaultData!E94+$D$142*DefaultData!E95+$D$143*DefaultData!E96","v":0},null,null,{"$f":"F88+E88+D88","v":0},{"$f":"G88*G$40","v":0},null,null,null,{"$f":"$H88*Multipliers!D214","v":0},{"$f":"$H88*Multipliers!E214","v":0},{"$f":"$H88*Multipliers!F214","v":0},{"$f":"+N88+M88+L88","v":0},{"$f":"$H88*Multipliers!H214","v":0},{"$f":"$H88*Multipliers!I214","v":0},{"$f":"$H88*Multipliers!J214","v":0},{"$f":"+R88+Q88+P88","v":0},{"$f":"$H88*Multipliers!L214","v":0},{"$f":"$H88*Multipliers!M214","v":0},{"$f":"$H88*Multipliers!N214","v":0},{"$f":"+V88+U88+T88","v":0},{"$f":"$H88*Multipliers!P214","v":0},{"$f":"$H88*Multipliers!Q214","v":0},{"$f":"$H88*Multipliers!R214","v":0},{"$f":"+Z88+Y88+X88","v":0}]
[null,null,"Construction",{"$f":"$D$130*DefaultData!F83+$D$131*DefaultData!F84+$D$132*DefaultData!F85+$D$133*DefaultData!F86+$D$134*DefaultData!F87+$D$135*DefaultData!F88+$D$136*DefaultData!F89+$D$137*DefaultData!F90+$D$138*DefaultData!F91+$D$139*DefaultData!F92+$D$140*DefaultData!F93+$D$141*DefaultData!F94+$D$142*DefaultData!F95+$D$143*DefaultData!F96","v":0},null,null,0,0,null,null,null,{"$f":"$H89*Multipliers!D215","v":0},{"$f":"$H89*Multipliers!E215","v":0},{"$f":"$H89*Multipliers!F215","v":0},0,{"$f":"$H89*Multipliers!H215","v":0},{"$f":"$H89*Multipliers!I215","v":0},{"$f":"$H89*Multipliers!J215","v":0},0,{"$f":"$H89*Multipliers!L215","v":0},{"$f":"$H89*Multipliers!M215","v":0},{"$f":"$H89*Multipliers!N215","v":0},0,{"$f":"$H89*Multipliers!P215","v":0},{"$f":"$H89*Multipliers!Q215","v":0},{"$f":"$H89*Multipliers!R215","v":0},0]
[null,null,"Manufacturing",{"$f":"$D$130*DefaultData!G83+$D$131*DefaultData!G84+$D$132*DefaultData!G85+$D$133*DefaultData!G86+$D$134*DefaultData!G87+$D$135*DefaultData!G88+$D$136*DefaultData!G89+$D$137*DefaultData!G90+$D$138*DefaultData!G91+$D$139*DefaultData!G92+$D$140*DefaultData!G93+$D$141*DefaultData!G94+$D$142*DefaultData!G95+$D$143*DefaultData!G96","v":0.54929592410000005},null,null,0.54929592410000005,0.5956015705016301,null,null,null,{"$f":"$H90*Multipliers!D216","v":1.0573394419534812},{"$f":"$H90*Multipliers!E216","v":1.2761092681873885},{"$f":"$H90*Multipliers!F216","v":1.0551936540669062},3.3886423642077759,{"$f":"$H90*Multipliers!H216","v":0.10136494701829447},{"$f":"$H90*Multipliers!I216","v":9.2652535726347379E-2},{"$f":"$H90*Multipliers!J216","v":6.2402195575393761E-2},0.25641967832003559,{"$f":"$H90*Multipliers!L216","v":0.5956015705016301},{"$f":"$H90*Multipliers!M216","v":0.31834194101314356},{"$f":"$H90*Multipliers!N216","v":0.17572466112567786},1.0896681726404516,{"$f":"$H90*Multipliers!P216","v":0.1864510314675025},{"$f":"$H90*Multipliers!Q216","v":0.16875496639621246},{"$f":"$H90*Multipliers!R216","v":0.10790546587697258},0.46311146374068757]
[null,null,"Fabricated Metals",{"$f":"$D$130*DefaultData!H83+$D$131*DefaultData!H84+$D$132*DefaultData!H85+$D$133*DefaultData!H86+$D$134*DefaultData!H87+$D$135*DefaultData!H88+$D$136*DefaultData!H89+$D$137*DefaultData!H90+$D$138*DefaultData!H91+$D$139*DefaultData!H92+$D$140*DefaultData!H93+$D$141*DefaultData!H94+$D$142*DefaultData!H95+$D$143*DefaultData!H96","v":0},null,null,0,0,null,null,null,{"$f":"$H91*Multipliers!D217","v":0},{"$f":"$H91*Multipliers!E217","v":0},{"$f":"$H91*Multipliers!F217","v":0},0,{"$f":"$H91*Multipliers!H217","v":0},{"$f":"$H91*Multipliers!I217","v":0},{"$f":"$H91*Multipliers!J217","v":0},0,{"$f":"$H91*Multipliers!L217","v":0},{"$f":"$H91*Multipliers!M217","v":0},{"$f":"$H91*Multipliers!N217","v":0},0,{"$f":"$H91*Multipliers!P217","v":0},{"$f":"$H91*Multipliers!Q217","v":0},{"$f":"$H91*Multipliers!R217","v":0},0]
[null,null,"Machinery",{"$f":"$D$130*DefaultData!I83+$D$131*DefaultData!I84+$D$132*DefaultData!I85+$D$133*DefaultData!I86+$D$134*DefaultData!I87+$D$135*DefaultData!I88+$D$136*DefaultData!I89+$D$137*DefaultData!I90+$D$138*DefaultData!I91+$D$139*DefaultData!I92+$D$140*DefaultData!I93+$D$141*DefaultData!I94+$D$142*DefaultData!I95+$D$143*DefaultData!I96","v":0},null,null,0,0,null,null,null,{"$f":"$H92*Multipliers!D218","v":0},{"$f":"$H92*Multipliers!E218","v":0},{"$f":"$H92*Multipliers!F218","v":0},0,{"$f":"$H92*Multipliers!H218","v":0},{"$f":"$H92*Multipliers!I218","v":0},{"$f":"$H92*Multipliers!J218","v":0},0,{"$f":"$H92*Multipliers!L218","v":0},{"$f":"$H92*Multipliers!M218","v":0},{"$f":"$H92*Multipliers!N218","v":0},0,{"$f":"$H92*Multipliers!P218","v":0},{"$f":"$H92*Multipliers!Q218","v":0},{"$f":"$H92*Multipliers!R218","v":0},0]
[null,null,"Electrical Equipment",{"$f":"$D$130*DefaultData!J83+$D$131*DefaultData!J84+$D$132*DefaultData!J85+$D$133*DefaultData!J86+$D$134*DefaultData!J87+$D$135*DefaultData!J88+$D$136*DefaultData!J89+$D$137*DefaultData!J90+$D$138*DefaultData!J91+$D$139*DefaultData!J92+$D$140*DefaultData!J93+$D$141*DefaultData!J94+$D$142*DefaultData!J95+$D$143*DefaultData!J96","v":0},null,null,0,0,null,null,null,{"$f":"$H93*Multipliers!D219","v":0},{"$f":"$H93*Multipliers!E219","v":0},{"$f":"$H93*Multipliers!F219","v":0},0,{"$f":"$H93*Multipliers!H219","v":0},{"$f":"$H93*Multipliers!I219","v":0},{"$f":"$H93*Multipliers!J219","v":0},0,{"$f":"$H93*Multipliers!L219","v":0},{"$f":"$H93*Multipliers!M219","v":0},{"$f":"$H93*Multipliers!N219","v":0},0,{"$f":"$H93*Multipliers!P219","v":0},{"$f":"$H93*Multipliers!Q219","v":0},{"$f":"$H93*Multipliers!R219","v":0},0]
[null,null,"TCPU",{"$f":"$D$130*DefaultData!K83+$D$131*DefaultData!K84+$D$132*DefaultData!K85+$D$133*DefaultData!K86+$D$134*DefaultData!K87+$D$135*DefaultData!K88+$D$136*DefaultData!K89+$D$137*DefaultData!K90+$D$138*DefaultData!K91+$D$139*DefaultData!K92+$D$140*DefaultData!K93+$D$141*DefaultData!K94+$D$142*DefaultData!K95+$D$143*DefaultData!K96","v":2.2638296449999998E-2},null,null,2.2638296449999998E-2,2.4546704840734998E-2,null,null,null,{"$f":"$H94*Multipliers!D220","v":7.8616642155701466E-2},{"$f":"$H94*Multipliers!E220","v":5.6908625289608772E-2},{"$f":"$H94*Multipliers!F220","v":5.7232219843062607E-2},0.19275748728837283,{"$f":"$H94*Multipliers!H220","v":6.5524629502723419E-3},{"$f":"$H94*Multipliers!I220","v":3.93530172210941E-3},{"$f":"$H94*Multipliers!J220","v":3.3602575373672121E-3},1.3848022209748964E-2,{"$f":"$H94*Multipliers!L220","v":2.4546704840734998E-2},{"$f":"$H94*Multipliers!M220","v":1.2307366513893947E-2},{"$f":"$H94*Multipliers!N220","v":9.4612824477850067E-3},4.6315353802413951E-2,{"$f":"$H94*Multipliers!P220","v":1.0709254242856962E-2},{"$f":"$H94*Multipliers!Q220","v":6.9020430598479756E-3},{"$f":"$H94*Multipliers!R220","v":5.8100601493410974E-3},2.3421357452046036E-2]
[null,null,"Wholesale Trade",{"$f":"$D$130*DefaultData!L83+$D$131*DefaultData!L84+$D$132*DefaultData!L85+$D$133*DefaultData!L86+$D$134*DefaultData!L87+$D$135*DefaultData!L88+$D$136*DefaultData!L89+$D$137*DefaultData!L90+$D$138*DefaultData!L91+$D$139*DefaultData!L92+$D$140*DefaultData!L93+$D$141*DefaultData!L94+$D$142*DefaultData!L95+$D$143*DefaultData!L96","v":0.41173979577499997},null,null,0.41173979577499997,0.4464494605588325,null,null,null,{"$f":"$H95*Multipliers!D221","v":1.5069440250349249},{"$f":"$H95*Multipliers!E221","v":0.92667689749254922},{"$f":"$H95*Multipliers!F221","v":1.0486475986135257},3.4822685211410001,{"$f":"$H95*Multipliers!H221","v":0.14790781055371852},{"$f":"$H95*Multipliers!I221","v":6.6887537139427689E-2},{"$f":"$H95*Multipliers!J221","v":6.9051486563927802E-2},0.28384683425707402,{"$f":"$H95*Multipliers!L221","v":0.4464494605588325},{"$f":"$H95*Multipliers!M221","v":0.18392166406406424},{"$f":"$H95*Multipliers!N221","v":0.19444683337768479},0.82481795800058155,{"$f":"$H95*Multipliers!P221","v":0.29561500483813746},{"$f":"$H95*Multipliers!Q221","v":0.11506233164267685},{"$f":"$H95*Multipliers!R221","v":0.11940248460920093},0.53007982109001528]
[null,null,"Retail Trade",{"$f":"$D$130*DefaultData!M83+$D$131*DefaultData!M84+$D$132*DefaultData!M85+$D$133*DefaultData!M86+$D$134*DefaultData!M87+$D$135*DefaultData!M88+$D$136*DefaultData!M89+$D$137*DefaultData!M90+$D$138*DefaultData!M91+$D$139*DefaultData!M92+$D$140*DefaultData!M93+$D$141*DefaultData!M94+$D$142*DefaultData!M95+$D$143*DefaultData!M96","v":0},null,null,0,0,null,null,null,{"$f":"$H96*Multipliers!D222","v":0},{"$f":"$H96*Multipliers!E222","v":0},{"$f":"$H96*Multipliers!F222","v":0},0,{"$f":"$H96*Multipliers!H222","v":0},{"$f":"$H96*Multipliers!I222","v":0},{"$f":"$H96*Multipliers!J222","v":0},0,{"$f":"$H96*Multipliers!L222","v":0},{"$f":"$H96*Multipliers!M222","v":0},{"$f":"$H96*Multipliers!N222","v":0},0,{"$f":"$H96*Multipliers!P222","v":0},{"$f":"$H96*Multipliers!Q222","v":0},{"$f":"$H96*Multipliers!R222","v":0},0]
[null,null,"FIRE",{"$f":"$D$130*DefaultData!N83+$D$131*DefaultData!N84+$D$132*DefaultData!N85+$D$133*DefaultData!N86+$D$134*DefaultData!N87+$D$135*DefaultData!N88+$D$136*DefaultData!N89+$D$137*DefaultData!N90+$D$138*DefaultData!N91+$D$139*DefaultData!N92+$D$140*DefaultData!N93+$D$141*DefaultData!N94+$D$142*DefaultData!N95+$D$143*DefaultData!N96","v":0.43910250000000006},null,null,0.43910250000000006,0.47611884075000011,null,null,null,{"$f":"$H97*Multipliers!D223","v":2.0979363829774442},{"$f":"$H97*Multipliers!E223","v":1.0247371023787721},{"$f":"$H97*Multipliers!F223","v":0.9841597821528234},4.1068332675090398,{"$f":"$H97*Multipliers!H223","v":0.11898393503087513},{"$f":"$H97*Multipliers!I223","v":6.338138012604648E-2},{"$f":"$H97*Multipliers!J223","v":5.8264693849349312E-2},0.24063000900627091,{"$f":"$H97*Multipliers!L223","v":0.47611884075000011},{"$f":"$H97*Multipliers!M223","v":0.19735381268324406},{"$f":"$H97*Multipliers!N223","v":0.16403811165476051},0.8375107650880047,{"$f":"$H97*Multipliers!P223","v":0.31425348819573168},{"$f":"$H97*Multipliers!Q223","v":0.12405039066453072},{"$f":"$H97*Multipliers!R223","v":0.10073699413672667},0.53904087299698911]
[null,null,"Misc. Services",{"$f":"$D$130*DefaultData!O83+$D$131*DefaultData!O84+$D$132*DefaultData!O85+$D$133*DefaultData!O86+$D$134*DefaultData!O87+$D$135*DefaultData!O88+$D$136*DefaultData!O89+$D$137*DefaultData!O90+$D$138*DefaultData!O91+$D$139*DefaultData!O92+$D$140*DefaultData!O93+$D$141*DefaultData!O94+$D$142*DefaultData!O95+$D$143*DefaultData!O96","v":0},null,null,0,0,null,null,null,{"$f":"$H98*Multipliers!D224","v":0},{"$f":"$H98*Multipliers!E224","v":0},{"$f":"$H98*Multipliers!F224","v":0},0,{"$f":"$H98*Multipliers!H224","v":0},{"$f":"$H98*Multipliers!I224","v":0},{"$f":"$H98*Multipliers!J224","v":0},0,{"$f":"$H98*Multipliers!L224","v":0},{"$f":"$H98*Multipliers!M224","v":0},{"$f":"$H98*Multipliers!N224","v":0},0,{"$f":"$H98*Multipliers!P224","v":0},{"$f":"$H98*Multipliers!Q224","v":0},{"$f":"$H98*Multipliers!R224","v":0},0]
[null,null,"Professional Services",{"$f":"$D$130*DefaultData!P83+$D$131*DefaultData!P84+$D$132*DefaultData!P85+$D$133*DefaultData!P86+$D$134*DefaultData!P87+$D$135*DefaultData!P88+$D$136*DefaultData!P89+$D$137*DefaultData!P90+$D$138*DefaultData!P91+$D$139*DefaultData!P92+$D$140*DefaultData!P93+$D$141*DefaultData!P94+$D$142*DefaultData!P95+$D$143*DefaultData!P96","v":0},null,null,0,0,null,null,null,{"$f":"$H99*Multipliers!D225","v":0},{"$f":"$H99*Multipliers!E225","v":0},{"$f":"$H99*Multipliers!F225","v":0},0,{"$f":"$H99*Multipliers!H225","v":0},{"$f":"$H99*Multipliers!I225","v":0},{"$f":"$H99*Multipliers!J225","v":0},0,{"$f":"$H99*Multipliers!L225","v":0},{"$f":"$H99*Multipliers!M225","v":0},{"$f":"$H99*Multipliers!N225","v":0},0,{"$f":"$H99*Multipliers!P225","v":0},{"$f":"$H99*Multipliers!Q225","v":0},{"$f":"$H99*Multipliers!R225","v":0},0]
[null,null,"Government",{"$f":"$D$130*DefaultData!Q83+$D$131*DefaultData!Q84+$D$132*DefaultData!Q85+$D$133*DefaultData!Q86+$D$134*DefaultData!Q87+$D$135*DefaultData!Q88+$D$136*DefaultData!Q89+$D$137*DefaultData!Q90+$D$138*DefaultData!Q91+$D$139*DefaultData!Q92+$D$140*DefaultData!Q93+$D$141*DefaultData!Q94+$D$142*DefaultData!Q95+$D$143*DefaultData!Q96","v":0.13581057954545456},null,null,0.13581057954545456,0.14725941140113638,null,null,null,0,{"$f":"$H100*Multipliers!E226","v":7.1251394480912E-2},{"$f":"$H100*Multipliers!F226","v":0.54736082942299347},0.61861222390390547,0,{"$f":"$H100*Multipliers!I226","v":5.3082968224044888E-3},{"$f":"$H100*Multipliers!J226","v":3.6994915692366397E-2},4.2303212514770885E-2,0,{"$f":"$H100*Multipliers!M226","v":1.5662557571323503E-2},{"$f":"$H100*Multipliers!N226","v":0.10418955047286109},0.11985210804418459,0,{"$f":"$H100*Multipliers!Q226","v":8.9199531720123709E-3},{"$f":"$H100*Multipliers!R226","v":6.3976013124025774E-2},7.2895966296038145E-2]
[null,null,"Total",{"$f":"SUM(D87:D100)","v":1.5585870958704546},null,null,1.5585870958704546,{"$f":"SUM(H87:H100)","v":1.689975988052334},null,null,"Total",{"$f":"SUM(L87:L100)","v":4.7408364921215522},{"$f":"SUM(M87:M100)","v":3.3556832878292306},3.6925940840993112,11.789113864050094,0.37480915555316047,0.23216505153633546,0.23007354921840451,0.8370477563079004,1.5427165766511977,0.72758734184566931,0.64786043907876922,2.9181643575756362,{"$f":"SUM(X87:X100)","v":0.80702877874422851},0.42368968493528042,0.39783101789626707,1.6285494815757762]
[]
[null,null,"Plant Employees",null,"Earnings - Gross ",null,{"$f":"G66","v":0.76},{"$f":"G103*G40","v":0.82406800000000002}]
[null,null,"Plant Employees",null,"Employee - (SSI, Med, Inc Tax)",{"$f":"IF(ProjectData!B$24=\"y\",Calculations!K27,Calculations!M27)","v":7.1186945514116112E-2},{"$f":"G$103*F104","v":5.4102078590728249E-2},0,null,null,null,null,null,null,"Inflate to ",{"$f":"D40","v":2009},"Dollars",null,null,{"$f":"P104","v":2009},"Dollars",null,null,{"$f":"T104","v":2009},"Dollars"]
[null,null,"  Technicians and other personnel",{"$f":"Calculations!H34","v":9.5000000000000036},"Other benefits",{"$f":"IF(ProjectData!B$24=\"y\",Calculations!K28,Calculations!M28)","v":0.17454798409023592},{"$f":"G$103*F105","v":0.1326564679085793},{"$f":"IF(ProjectData!B12=\"MyCounty\",0,IF(ProjectData!B12=\"MyRegion\",0,1))","v":1},null,"Without Plant Employees",null,{"$f":"L101","v":4.7408364921215522},{"$f":"M101","v":3.3556832878292306},{"$f":"N101","v":3.6925940840993112},{"$f":"O101","v":11.789113864050094},{"$f":"P101*$G61","v":0.3456692387283597},{"$f":"Q101*$G61","v":0.21411514482738675},{"$f":"R101*$G61","v":0.21218624847219819},{"$f":"+R105+Q105+P105","v":0.77197063202794469},{"$f":"T101*$G61","v":1.4227765163250001},{"$f":"U101*$G61","v":0.67102032818008783},{"$f":"V101*$G61","v":0.59749187409275029},{"$f":"+V105+U105+T105","v":2.6912887185978382},{"$f":"X101*$G61","v":0.74428551023169642},{"$f":"Y101*$G61","v":0.39074950192315816},{"$f":"Z101*$G61","v":0.36690124310270872},{"$f":"+Z105+Y105+X105","v":1.5019362552575632}]
[null,null,null,null,"Earnings (minus taxes, benefits, etc)",null,{"$f":"G103-G104-G105","v":0.57324145350069244},null,null,"With Plant Employees",null,{"$f":"L105+L126","v":14.240836492121556},{"$f":"M105+M126","v":4.9709396808148441},{"$f":"N105+N126","v":5.8741967002838402},{"$f":"O105+O126","v":25.085972873220239},{"$f":"(P101+P126)*$G61","v":1.0515671601376313},{"$f":"(Q101+Q126)*$G61","v":0.31999515837599257},{"$f":"(R101+R126)*$G61","v":0.33926860732866782},{"$f":"+R106+Q106+P106","v":1.7108309258422918},{"$f":"(T101+T126)*$G61","v":2.1286744377342717},{"$f":"(U101+U126)*$G61","v":0.96913087306834089},{"$f":"(V101+V126)*$G61","v":0.95532063396396061},{"$f":"+V106+U106+T106","v":4.0531259447665731},{"$f":"(X101+X126)*$G61","v":1.4501834316409681},{"$f":"(Y101+Y126)*$G61","v":0.57518465393553952},{"$f":"(Z101+Z126)*$G61","v":0.58663727606844451},{"$f":"+Z106+Y106+X106","v":2.6120053616449521}]
[]
[null,null,"  Total",{"$f":"SUM(D105:D107)","v":9.5000000000000036}]
[null,null,null,null,null,null,null,null,null,null,null,"Plant Employees Only"]
[null,null,"Plant Employee Spending",null,null,"PCE ",null,"Adj Demand - Million",null,null,null,"Jobs",null,null,null,"Earnings",null,null,null,"Output",null,null,null,"Value Added"]
[null,null,null,null,null,"Plant Emp",null,{"$f":"H86","v":2014},"Dollars",null,null,"Direct","Indirect","Induced","Total","Direct","Indirect","Induced","Total","Direct","Indirect","Induced","Total","Direct","Indirect","Induced","Total"]
[null,null,"Agriculture",null,null,{"$f":"G$106*Multipliers!U213","v":2.2810706175193278E-3},null,{"$f":"F112*G$40","v":2.4733648705762071E-3},null,null,null,null,{"$f":"$H112*Multipliers!E213","v":1.9377995088960122E-3},{"$f":"$H112*Multipliers!F213","v":5.8613825546846767E-3},{"$f":"N112+M112","v":7.7991820635806893E-3},null,{"$f":"$H112*Multipliers!I213","v":1.4604344528344146E-4},{"$f":"$H112*Multipliers!J213","v":3.8624175641568015E-4},{"$f":"R112+Q112","v":5.3228520169912156E-4},{"$f":"$H112*Multipliers!L213","v":2.4733648705762071E-3},{"$f":"$H112*Multipliers!M213","v":4.5180660553981465E-4},{"$f":"$H112*Multipliers!N213","v":1.0871001129122431E-3},{"$f":"V112+U112","v":1.5389067184520577E-3},null,{"$f":"$H112*Multipliers!Q213","v":2.6657803616349224E-4},{"$f":"$H112*Multipliers!R213","v":6.6766716194280643E-4},{"$f":"Z112+Y112","v":9.3424519810629872E-4}]
[null,null,"Mining",null,null,{"$f":"G$106*Multipliers!U214","v":4.3772669782638777E-6},null,{"$f":"F113*G$40","v":4.7462705845315231E-6},null,null,null,null,{"$f":"$H113*Multipliers!E214","v":5.0579364583669061E-6},{"$f":"$H113*Multipliers!F214","v":7.1940295231076296E-6},{"$f":"N113+M113","v":1.2251965981474537E-5},null,{"$f":"$H113*Multipliers!I214","v":3.5749361717072928E-7},{"$f":"$H113*Multipliers!J214","v":4.1271222254421412E-7},{"$f":"R113+Q113","v":7.7020583971494341E-7},{"$f":"$H113*Multipliers!L214","v":4.7462705845315231E-6},{"$f":"$H113*Multipliers!M214","v":1.1864448676317464E-6},{"$f":"$H113*Multipliers!N214","v":1.161852248984611E-6},{"$f":"V113+U113","v":2.3482971166163572E-6},null,{"$f":"$H113*Multipliers!Q214","v":6.8063124948113828E-7},{"$f":"$H113*Multipliers!R214","v":7.1352301584550011E-7},{"$f":"Z113+Y113","v":1.3941542653266385E-6}]
[null,null,"Construction",null,null,{"$f":"G$106*Multipliers!U215","v":0},null,0,null,null,null,null,{"$f":"$H114*Multipliers!E215","v":0},{"$f":"$H114*Multipliers!F215","v":0},0,null,{"$f":"$H114*Multipliers!I215","v":0},{"$f":"$H114*Multipliers!J215","v":0},0,{"$f":"$H114*Multipliers!L215","v":0},{"$f":"$H114*Multipliers!M215","v":0},{"$f":"$H114*Multipliers!N215","v":0},0,null,{"$f":"$H114*Multipliers!Q215","v":0},{"$f":"$H114*Multipliers!R215","v":0},0]
[null,null,"Manufacturing",null,null,{"$f":"G$106*Multipliers!U216","v":4.8293845282203277E-2},null,5.2365016439493012E-2,null,null,null,null,{"$f":"$H115*Multipliers!E216","v":0.11219494057233871},{"$f":"$H115*Multipliers!F216","v":9.2772141274787029E-2},0.20496708184712575,null,{"$f":"$H115*Multipliers!I216","v":8.1459683734289544E-3},{"$f":"$H115*Multipliers!J216","v":5.4863723653613321E-3},1.3632340738790286E-2,{"$f":"$H115*Multipliers!L216","v":5.2365016439493012E-2},{"$f":"$H115*Multipliers!M216","v":2.7988477197085821E-2},{"$f":"$H115*Multipliers!N216","v":1.5449631472463143E-2},4.3438108669548961E-2,null,{"$f":"$H115*Multipliers!Q216","v":1.4836859113956231E-2},{"$f":"$H115*Multipliers!R216","v":9.4869989845726178E-3},2.4323858098528849E-2]
[null,null,"Fabricated Metals",null,null,{"$f":"G$106*Multipliers!U217","v":1.0659851395843653E-6},null,1.1558476868513274E-6,null,null,null,null,{"$f":"$H116*Multipliers!E217","v":2.5792460689187631E-6},{"$f":"$H116*Multipliers!F217","v":2.7350106363019263E-6},5.3142567052206894E-6,null,{"$f":"$H116*Multipliers!I217","v":1.8319076741403279E-7},{"$f":"$H116*Multipliers!J217","v":1.592602160963032E-7},3.4245098351033599E-7,{"$f":"$H116*Multipliers!L217","v":1.1558476868513274E-6},{"$f":"$H116*Multipliers!M217","v":6.3553277711583651E-7},{"$f":"$H116*Multipliers!N217","v":4.4849571544945907E-7},1.0840284925652955E-6,null,{"$f":"$H116*Multipliers!Q217","v":3.185586683019944E-7},{"$f":"$H116*Multipliers!R217","v":2.7539907423219192E-7},5.9395774253418638E-7]
[null,null,"Machinery",null,null,{"$f":"G$106*Multipliers!U218","v":6.9376404697786973E-6},null,7.5224835613810415E-6,null,null,null,null,{"$f":"$H117*Multipliers!E218","v":1.6348349073103902E-5},{"$f":"$H117*Multipliers!F218","v":1.4729062073021726E-5},3.107741114612563E-5,null,{"$f":"$H117*Multipliers!I218","v":1.1741079459535465E-6},{"$f":"$H117*Multipliers!J218","v":8.5539136627773852E-7},2.0294993122312852E-6,{"$f":"$H117*Multipliers!L218","v":7.5224835613810415E-6},{"$f":"$H117*Multipliers!M218","v":4.0626761958886301E-6},{"$f":"$H117*Multipliers!N218","v":2.4089023218740209E-6},6.4715785177626506E-6,null,{"$f":"$H117*Multipliers!Q218","v":2.0729851819633261E-6},{"$f":"$H117*Multipliers!R218","v":1.4791840625808763E-6},3.5521692445442025E-6]
[null,null,"Electrical Equipment",null,null,{"$f":"G$106*Multipliers!U219","v":1.8646381324541514E-5},null,2.0218271270200362E-5,null,null,null,null,{"$f":"$H118*Multipliers!E219","v":4.9902605113870006E-5},{"$f":"$H118*Multipliers!F219","v":4.5710464375773106E-5},9.5613069489643106E-5,null,{"$f":"$H118*Multipliers!I219","v":3.7745364640349221E-6},{"$f":"$H118*Multipliers!J219","v":2.6414553553451307E-6},6.4159918193800528E-6,{"$f":"$H118*Multipliers!L219","v":2.0218271270200362E-5},{"$f":"$H118*Multipliers!M219","v":1.2548678413604224E-5},{"$f":"$H118*Multipliers!N219","v":7.4387692591835955E-6},1.9987447672787821E-5,null,{"$f":"$H118*Multipliers!Q219","v":6.5057219719495981E-6},{"$f":"$H118*Multipliers!R219","v":4.5677556644468063E-6},1.1073477636396404E-5]
[null,null,"TCPU",null,null,{"$f":"G$106*Multipliers!U220","v":1.6486880884773937E-2},null,1.7876724943360379E-2,null,null,null,null,{"$f":"$H119*Multipliers!E220","v":4.1445067588820869E-2},{"$f":"$H119*Multipliers!F220","v":4.1680733062569669E-2},8.3125800651390538E-2,null,{"$f":"$H119*Multipliers!I220","v":2.865977609285331E-3},{"$f":"$H119*Multipliers!J220","v":2.4471879270198814E-3},5.3131655363052119E-3,{"$f":"$H119*Multipliers!L220","v":1.7876724943360379E-2},{"$f":"$H119*Multipliers!M220","v":8.9631340488884256E-3},{"$f":"$H119*Multipliers!N220","v":6.8904052510467845E-3},1.5853539299935208E-2,null,{"$f":"$H119*Multipliers!Q220","v":5.0265779512439508E-3},{"$f":"$H119*Multipliers!R220","v":4.2313152770626673E-3},9.2578932283066181E-3]
[null,null,"Wholesale Trade",null,null,{"$f":"G$106*Multipliers!U221","v":2.5491448149452822E-2},null,2.7640377228451696E-2,null,null,null,null,{"$f":"$H120*Multipliers!E221","v":5.7372001264205774E-2},{"$f":"$H120*Multipliers!F221","v":6.4923396187121715E-2},0.12229539745132749,null,{"$f":"$H120*Multipliers!I221","v":4.14111096942903E-3},{"$f":"$H120*Multipliers!J221","v":4.2750844281976997E-3},8.4161953976267297E-3,{"$f":"$H120*Multipliers!L221","v":2.7640377228451696E-2},{"$f":"$H120*Multipliers!M221","v":1.1386874941795086E-2},{"$f":"$H120*Multipliers!N221","v":1.2038504467470051E-2},2.3425379409265139E-2,null,{"$f":"$H120*Multipliers!Q221","v":7.1236870740259252E-3},{"$f":"$H120*Multipliers!R221","v":7.3923926629491325E-3},1.4516079736975059E-2]
[null,null,"Retail Trade",null,null,{"$f":"G$106*Multipliers!U222","v":5.4926022290142387E-2},null,5.9556285969201393E-2,null,null,null,null,{"$f":"$H121*Multipliers!E222","v":0.11412749806620399},{"$f":"$H121*Multipliers!F222","v":0.17125441107201358},0.28538190913821759,null,{"$f":"$H121*Multipliers!I222","v":7.2526700284160249E-3},{"$f":"$H121*Multipliers!J222","v":1.0311185126003795E-2},1.756385515441982E-2,{"$f":"$H121*Multipliers!L222","v":5.9556285969201393E-2},{"$f":"$H121*Multipliers!M222","v":2.1017244607830332E-2},{"$f":"$H121*Multipliers!N222","v":2.9033755791830415E-2},5.0051000399660747E-2,null,{"$f":"$H121*Multipliers!Q222","v":1.3074936434310994E-2},{"$f":"$H121*Multipliers!R222","v":1.7829024000407936E-2},3.0903960434718929E-2]
[null,null,"FIRE",null,null,{"$f":"(G$106*Multipliers!U223)+(G105*H105)","v":0.20119500249810296},null,0.21815574120869305,null,null,null,null,{"$f":"$H122*Multipliers!E223","v":0.46953042597797962},{"$f":"$H122*Multipliers!F223","v":0.45093806076888593},0.92046848674686554,null,{"$f":"$H122*Multipliers!I223","v":2.9041093896739676E-2},{"$f":"$H122*Multipliers!J223","v":2.6696648788314885E-2},5.5737742685054562E-2,{"$f":"$H122*Multipliers!L223","v":0.21815574120869305},{"$f":"$H122*Multipliers!M223","v":9.0426724593495655E-2},{"$f":"$H122*Multipliers!N223","v":7.5161604145190769E-2},0.16558832873868642,null,{"$f":"$H122*Multipliers!Q223","v":5.6839390938655331E-2},{"$f":"$H122*Multipliers!R223","v":4.615728625318713E-2},0.10299667719184247]
[null,null,"Misc. Services",null,null,{"$f":"G$106*Multipliers!U224","v":0.34756771912422779},null,0.37686767784640018,null,null,null,null,{"$f":"$H123*Multipliers!E224","v":0.80255465154281191},{"$f":"$H123*Multipliers!F224","v":1.3203981350932372},2.1229527866360494,null,{"$f":"$H123*Multipliers!I224","v":6.2148452650080059E-2},{"$f":"$H123*Multipliers!J224","v":8.6048484539468256E-2},0.14819693718954832,{"$f":"$H123*Multipliers!L224","v":0.37686767784640018},{"$f":"$H123*Multipliers!M224","v":0.15993494954347653},{"$f":"$H123*Multipliers!N224","v":0.24229453847059917},0.40222948801407571,null,{"$f":"$H123*Multipliers!Q224","v":0.10096531809424394},{"$f":"$H123*Multipliers!R224","v":0.14878731705508016},0.24975263514932411]
[null,null,"Professional Services",null,null,{"$f":"G$106*Multipliers!U225","v":5.6830559232605108E-3},null,6.1621375375913723E-3,null,null,null,null,{"$f":"$H124*Multipliers!E225","v":1.3952076254211338E-2},{"$f":"$H124*Multipliers!F225","v":1.7817051951459693E-2},3.1769128205671029E-2,null,{"$f":"$H124*Multipliers!I225","v":9.048211340799817E-4},{"$f":"$H124*Multipliers!J225","v":1.0663648872151386E-3},1.9711860212951204E-3,{"$f":"$H124*Multipliers!L225","v":6.1621375375913723E-3},{"$f":"$H124*Multipliers!M225","v":2.5990192968146676E-3},{"$f":"$H124*Multipliers!N225","v":3.0026653289010317E-3},5.6016846257156989E-3,null,{"$f":"$H124*Multipliers!Q225","v":1.5812116082084388E-3},{"$f":"$H124*Multipliers!R225","v":1.8438643347368935E-3},3.4250759429453326E-3]
[null,null,"Government",null,null,{"$f":"(G$106*Multipliers!U226)+(G104*H104)","v":3.9418493656766078E-3},null,4.2741472672031457E-3,null,null,null,null,{"$f":"$H125*Multipliers!E226","v":2.068044073430632E-3},{"$f":"$H125*Multipliers!F226","v":1.58869356531618E-2},1.7954979726592431E-2,null,{"$f":"$H125*Multipliers!I226","v":1.5407125521627751E-4},{"$f":"$H125*Multipliers!J226","v":1.073763070913092E-3},1.2278343261293695E-3,{"$f":"$H125*Multipliers!L226","v":4.2741472672031457E-3},{"$f":"$H125*Multipliers!M226","v":4.5459965515227968E-4},{"$f":"$H125*Multipliers!N226","v":3.0240612683941973E-3},3.4786609235464769E-3,null,{"$f":"$H125*Multipliers!Q226","v":2.5889817914512254E-4},{"$f":"$H125*Multipliers!R226","v":1.8568789529909613E-3},2.1157771321360839E-3]
[null,null,"Total",null,null,{"$f":"SUM(F112:F125)","v":0.70589792140927177},null,{"$f":"SUM(H112:H125)","v":0.76540511618407325},null,null,null,{"$f":"IF(L128=0,0,D108)","v":9.5000000000000036},{"$f":"SUM(M112:M125)","v":1.6152563929856132},{"$f":"SUM(N112:N125)","v":2.181602616184529},{"$f":"N126+M126+L126","v":13.296859009170145},{"$f":"H126","v":0.76540511618407325},{"$f":"SUM(Q112:Q125)","v":0.11480569869075335},{"$f":"SUM(R112:R125)","v":0.13779540170807003},{"$f":"R126+Q126+P126","v":1.0180062165828967},{"$f":"SUM(T112:T125)","v":0.76540511618407325},{"$f":"SUM(U112:U125)","v":0.32324126382233281},{"$f":"SUM(V112:V125)","v":0.38799372432835333},{"$f":"V126+U126+T126","v":1.4766401043347592},{"$f":"P126","v":0.76540511618407325},{"$f":"SUM(Y112:Y125)","v":0.1999830353270251},{"$f":"SUM(Z112:Z125)","v":0.23825978054474745},{"$f":"Z126+Y126+X126","v":1.2036479320558457}]
[null,null,null,null,null,null,null,null,null,null,null,null,null,null,"Inflate to ",{"$f":"P104","v":2009},"Dollars"]
[null,null,"Annual O&M Costs Local Demand",null,"Construction Costs Local Demand",null,null,null,null,null,null,{"$f":"SUM(L133:L146)","v":4.7408364921215522},null,null,null,{"$f":"P126*$G61","v":0.70589792140927166},0.10588001354860588,0.12708235885646962,0.93886029381434721,0.70589792140927166,0.29811054488825306,0.35782875987121027,1.3618372261687348,{"$f":"X126*$G61","v":0.70589792140927166},0.18443515201238134,0.21973603296573591,1.1100691063873889]
[null,null,null,"Demand","Demand"]
[null,null,"Agriculture",0,0,null,null,null,null,null,null,"With Plant Employees"]
[null,null,"Mining",0,0,null,null,null,null,null,null,"Jobs",null,null,null,"Earnings",null,null,null,"Output",null,null,null,"Output"]
[null,null,"Construction",0,{"$f":"Y19+Y13","v":0.81103082279858363},null,null,null,null,null,null,"Direct","Indirect","Induced","Total","Direct","Indirect","Induced","Total","Direct","Indirect","Induced","Total","Direct","Indirect","Induced","Total"]
[null,null,"Manufacturing",{"$f":"G67*DefaultData!AI44","v":0.98367499999999997},{"$f":"X13+(G7*(1-DefaultData!AR16))","v":5.1958297228322152},null,null,null,null,"Agriculture",null,{"$f":"L87+L112","v":0},{"$f":"M87+M112","v":1.9377995088960122E-3},5.8613825546846767E-3,{"$f":"N133+M133+L133","v":7.7991820635806893E-3},0,1.4604344528344146E-4,3.8624175641568015E-4,{"$f":"R133+Q133+P133","v":5.3228520169912156E-4},2.4733648705762071E-3,4.5180660553981465E-4,1.0871001129122431E-3,{"$f":"V133+U133+T133","v":4.0122715890282649E-3},{"$f":"X87+X112","v":0},2.6657803616349224E-4,6.6766716194280643E-4,{"$f":"Z133+Y133+X133","v":9.3424519810629872E-4}]
[null,null,"Fabricated Metals",0,{"$f":"(G7*DefaultData!AR16)+G8+W11","v":4.2696848477654452},null,null,null,null,"Mining",null,{"$f":"L88+L113","v":0},5.0579364583669061E-6,7.1940295231076296E-6,{"$f":"N134+M134+L134","v":1.2251965981474537E-5},0,3.5749361717072928E-7,4.1271222254421412E-7,{"$f":"R134+Q134+P134","v":7.7020583971494341E-7},4.7462705845315231E-6,1.1864448676317464E-6,1.161852248984611E-6,{"$f":"V134+U134+T134","v":7.0945677011478804E-6},{"$f":"X88+X113","v":0},6.8063124948113828E-7,7.1352301584550011E-7,{"$f":"Z134+Y134+X134","v":1.3941542653266385E-6}]
[null,null,"Machinery",0,0,null,null,null,null,"Construction",null,{"$f":"L89+L114","v":0},0,0,0,0,0,0,0,0,0,0,0,{"$f":"X89+X114","v":0},0,0,0]
[null,null,"Electrical Equipment",0,{"$f":"X11+G9","v":0},null,null,null,null,"Manufacturing",null,{"$f":"L90+L115","v":1.0573394419534812},1.3883042087597273,1.1479657953416933,3.5936094460549017,0.10136494701829447,0.10079850409977634,6.7888567940755096E-2,0.27005201905882592,0.64796658694112308,0.34633041821022936,0.191174292598141,1.1854712977494934,{"$f":"X90+X115","v":0.1864510314675025},0.1835918255101687,0.1173924648615452,0.48743532183921645]
[null,null,"TCPU",0,0,null,null,null,null,"Fabricated Metals",null,{"$f":"L91+L116","v":0},2.5792460689187631E-6,2.7350106363019263E-6,5.3142567052206894E-6,0,1.8319076741403279E-7,1.592602160963032E-7,3.4245098351033599E-7,1.1558476868513274E-6,6.3553277711583651E-7,4.4849571544945907E-7,2.2398761794166229E-6,{"$f":"X91+X116","v":0},3.185586683019944E-7,2.7539907423219192E-7,5.9395774253418638E-7]
[null,null,"Wholesale Trade",0,{"$f":"W13+X19+(S16*Z19)","v":1.3379789070592059},null,null,null,null,"Machinery",null,{"$f":"L92+L117","v":0},1.6348349073103902E-5,1.4729062073021726E-5,3.107741114612563E-5,0,1.1741079459535465E-6,8.5539136627773852E-7,2.0294993122312852E-6,7.5224835613810415E-6,4.0626761958886301E-6,2.4089023218740209E-6,1.3994062079143692E-5,{"$f":"X92+X117","v":0},2.0729851819633261E-6,1.4791840625808763E-6,3.5521692445442025E-6]
[null,null,"Retail Trade",0,0,null,null,null,null,"Electrical Equipment",null,{"$f":"L93+L118","v":0},4.9902605113870006E-5,4.5710464375773106E-5,9.5613069489643106E-5,0,3.7745364640349221E-6,2.6414553553451307E-6,6.4159918193800528E-6,2.0218271270200362E-5,1.2548678413604224E-5,7.4387692591835955E-6,4.0205718942988183E-5,{"$f":"X93+X118","v":0},6.5057219719495981E-6,4.5677556644468063E-6,1.1073477636396404E-5]
[null,null,"FIRE",{"$f":"H70+H71+H72+(G67-D133)","v":0.43910250000000006},0,null,null,null,null,"TCPU",null,{"$f":"L94+L119","v":7.8616642155701466E-2},9.8353692878429641E-2,9.8912952905632276E-2,0.27588328793976336,6.5524629502723419E-3,6.801279331394741E-3,5.8074454643870935E-3,1.9161187746054176E-2,4.2423429784095378E-2,2.1270500562782374E-2,1.6351687698831791E-2,8.0045618045709532E-2,{"$f":"X94+X119","v":1.0709254242856962E-2},1.1928621011091926E-2,1.0041375426403765E-2,3.2679250680352656E-2]
[null,null,"Misc. Services",0,{"$f":"(S18*Z19)+(S19*Z19)","v":0.24771913947219162},null,null,null,null,"Wholesale Trade",null,{"$f":"L95+L120","v":1.5069440250349249},0.98404889875675505,1.1135709948006474,3.6045639185923273,0.14790781055371852,7.1028648108856715E-2,7.33265709921255E-2,0.29226302965470075,0.4740898377872842,0.19530853900585932,0.20648533784515483,0.87588371463829828,{"$f":"X95+X120","v":0.29561500483813746},0.12218601871670277,0.12679487727215005,0.54459590082699028]
[null,null,"Professional Services",0,{"$f":"G18+(S17*Z19)","v":1.9331292330301986},null,null,null,null,"Retail Trade",null,{"$f":"L96+L121","v":0},0.11412749806620399,0.17125441107201358,0.28538190913821759,0,7.2526700284160249E-3,1.0311185126003795E-2,1.756385515441982E-2,5.9556285969201393E-2,2.1017244607830332E-2,2.9033755791830415E-2,0.10960728636886213,{"$f":"X96+X121","v":0},1.3074936434310994E-2,1.7829024000407936E-2,3.0903960434718929E-2]
[null,null,"Government",{"$f":"G73+G69+G74","v":0.13581057954545456},{"$f":"G20","v":3.3903966244287487},null,null,null,null,"FIRE",null,{"$f":"L97+L122","v":2.0979363829774442},1.4942675283567517,1.4350978429217094,5.0273017542559053,0.11898393503087513,9.2422474022786152E-2,8.4961342637664194E-2,0.29636775169132545,0.69427458195869318,0.28778053727673969,0.23919971579995128,1.221254835035384,{"$f":"X97+X122","v":0.31425348819573168},0.18088978160318606,0.14689428038991381,0.64203755018883157]
[null,null,"Total",{"$f":"SUM(D130:D143)","v":1.5585880795454545},{"$f":"SUM(E130:E143)","v":17.185769297386589},null,null,null,null,"Misc. Services",null,{"$f":"L98+L123","v":0},0.80255465154281191,1.3203981350932372,2.1229527866360494,0,6.2148452650080059E-2,8.6048484539468256E-2,0.14819693718954832,0.37686767784640018,0.15993494954347653,0.24229453847059917,0.77909716586047595,{"$f":"X98+X123","v":0},0.10096531809424394,0.14878731705508016,0.24975263514932411]
[null,null,null,null,null,null,null,null,null,"Professional Services",null,{"$f":"L99+L124","v":0},1.3952076254211338E-2,1.7817051951459693E-2,3.1769128205671029E-2,0,9.048211340799817E-4,1.0663648872151386E-3,1.9711860212951204E-3,6.1621375375913723E-3,2.5990192968146676E-3,3.0026653289010317E-3,1.1763822163307071E-2,{"$f":"X99+X124","v":0},1.5812116082084388E-3,1.8438643347368935E-3,3.4250759429453326E-3]
[null,null,null,null,null,null,null,null,null,"Government",null,{"$f":"L100+L125","v":0},7.3319438554342628E-2,0.56324776507615526,0.6365672036304979,0,5.4623680776207661E-3,3.806867876327949E-2,4.3531046840900256E-2,4.2741472672031457E-3,1.6117157226475783E-2,0.10721361174125529,0.12760491623493422,{"$f":"X100+X125","v":0},9.1788513511574937E-3,6.583289207701673E-2,7.5011743428174224E-2]
[null,null,null,null,null,null,null,null,null,"Plant Employees",null,{"$f":"L126","v":9.5000000000000036},null,null,9.5000000000000036,{"$f":"P126","v":0.76540511618407325},null,null,0.76540511618407325,null,null,null,0,{"$f":"P147","v":0.76540511618407325},null,null,0.76540511618407325]
[null,null,null,null,null,null,null,null,null,"Total",null,{"$f":"SUM(L133:L147)","v":14.240836492121556},{"$f":"SUM(M133:M147)","v":4.9709396808148441},5.8741967002838411,25.085972873220243,1.1402142717372337,0.34697075022708879,0.36786895092647454,1.8550539728907971,2.3081216928352708,1.0508286056680021,1.0358541634071226,4.3948044619103959,{"$f":"SUM(X133:X147)","v":1.5724338949283019},0.62367272026230547,0.63609079844101446,2.8321974136316217]
[null,null,null,null,null,null,null,null,null,"Inflate to ",{"$f":"P127","v":2009},"Dollars",null,null,null,{"$f":"P148*$G61","v":1.0515671601376313},0.31999515837599257,0.33926860732866782,1.7108309258422918,2.1286744377342717,0.96913087306834089,0.95532063396396061,4.0531259447665731,{"$f":"X148*$G61","v":1.4501834316409681},0.57518465393553941,0.58663727606844451,2.6120053616449521]
[]
[null,null,"Default",null,null,null,null,"Default",null,null,null,null,"Default"]
[null,null,"From DefaultData",null,null,null,null,"From DefaultData",null,null,null,null,"From DefaultData"]
[null,null,"Debt - Loan Repayment Schedule",null,null,null,null,"Equity - Individual Investment Repayment Schedule",null,null,null,null,"Equity - Corporate Investment Repayment Schedule"]
[null,null,"Year","Interest Pmt","Principal Pmt","Total Pmt",null,"Year","Interest Pmt","Principal Pmt","Total Pmt",null,"Year","Interest Pmt","Principal Pmt","Total Pmt"]
[null,null,1,{"$f":"IF(C155<=DefaultData!D$45,-ISPMT(DefaultData!D$46,C155,DefaultData!D$45,DefaultData!D$30*DefaultData!D$44),0)","v":1.0050430000000001},{"$f":"IF(C155<=DefaultData!D$45,-PPMT(DefaultData!D$46,C155,DefaultData!D$45,DefaultData!D$44*DefaultData!D$30),0)","v":0.18471235431867092},{"$f":"E155+D155","v":1.189755354318671},null,1,{"$f":"IF(H155<=DefaultData!$D$53,-ISPMT(DefaultData!$D$52,$H155,DefaultData!$D$53,DefaultData!$D$32*DefaultData!$D$49*DefaultData!$D$50),0)","v":0},{"$f":"IF(H155<=DefaultData!$D$53,-PPMT(DefaultData!$D$52,$H155,DefaultData!$D$53,DefaultData!$D$32*DefaultData!$D$49*DefaultData!$D$50),0)","v":0},{"$f":"J155+I155","v":0},null,1,{"$f":"IF(M155<=DefaultData!$D$53,-ISPMT(DefaultData!$D$52,$H155,DefaultData!$D$53,DefaultData!$D$32*DefaultData!$D$49*DefaultData!$D$51),0)","v":4.8632310683506432},{"$f":"IF(M155<=DefaultData!$D$53,-PPMT(DefaultData!$D$52,$H155,DefaultData!$D$53,DefaultData!$D$32*DefaultData!$D$49*DefaultData!$D$51),0)","v":2.5659921995013621},{"$f":"O155+N155","v":7.4292232678520058}]
[null,null,2,{"$f":"IF(C156<=DefaultData!D$45,-ISPMT(DefaultData!D$46,C156,DefaultData!D$45,DefaultData!D$30*DefaultData!D$44),0)","v":0.95214599999999994},{"$f":"IF(C156<=DefaultData!D$45,-PPMT(DefaultData!D$46,C156,DefaultData!D$45,DefaultData!D$44*DefaultData!D$30),0)","v":0.20318358975053805},1.155329589750538,null,2,{"$f":"IF(H156<=DefaultData!$D$53,-ISPMT(DefaultData!$D$52,$H156,DefaultData!$D$53,DefaultData!$D$32*DefaultData!$D$49*DefaultData!$D$50),0)","v":0},{"$f":"IF(H156<=DefaultData!$D$53,-PPMT(DefaultData!$D$52,$H156,DefaultData!$D$53,DefaultData!$D$32*DefaultData!$D$49*DefaultData!$D$50),0)","v":0},0,null,2,{"$f":"IF(M156<=DefaultData!$D$53,-ISPMT(DefaultData!$D$52,$H156,DefaultData!$D$53,DefaultData!$D$32*DefaultData!$D$49*DefaultData!$D$51),0)","v":4.3228720607561275},{"$f":"IF(M156<=DefaultData!$D$53,-PPMT(DefaultData!$D$52,$H156,DefaultData!$D$53,DefaultData!$D$32*DefaultData!$D$49*DefaultData!$D$51),0)","v":2.8739112634415251},7.1967833241976527]
[null,null,3,{"$f":"IF(C157<=DefaultData!D$45,-ISPMT(DefaultData!D$46,C157,DefaultData!D$45,DefaultData!D$30*DefaultData!D$44),0)","v":0.89924899999999997},{"$f":"IF(C157<=DefaultData!D$45,-PPMT(DefaultData!D$46,C157,DefaultData!D$45,DefaultData!D$44*DefaultData!D$30),0)","v":0.22350194872559181},1.1227509487255918,null,3,{"$f":"IF(H157<=DefaultData!$D$53,-ISPMT(DefaultData!$D$52,$H157,DefaultData!$D$53,DefaultData!$D$32*DefaultData!$D$49*DefaultData!$D$50),0)","v":0},{"$f":"IF(H157<=DefaultData!$D$53,-PPMT(DefaultData!$D$52,$H157,DefaultData!$D$53,DefaultData!$D$32*DefaultData!$D$49*DefaultData!$D$50),0)","v":0},0,null,3,{"$f":"IF(M157<=DefaultData!$D$53,-ISPMT(DefaultData!$D$52,$H157,DefaultData!$D$53,DefaultData!$D$32*DefaultData!$D$49*DefaultData!$D$51),0)","v":3.7825130531616109},{"$f":"IF(M157<=DefaultData!$D$53,-PPMT(DefaultData!$D$52,$H157,DefaultData!$D$53,DefaultData!$D$32*DefaultData!$D$49*DefaultData!$D$51),0)","v":3.2187806150545084},7.0012936682161193]
[null,null,4,{"$f":"IF(C158<=DefaultData!D$45,-ISPMT(DefaultData!D$46,C158,DefaultData!D$45,DefaultData!D$30*DefaultData!D$44),0)","v":0.8463520000000001},{"$f":"IF(C158<=DefaultData!D$45,-PPMT(DefaultData!D$46,C158,DefaultData!D$45,DefaultData!D$44*DefaultData!D$30),0)","v":0.24585214359815102},1.0922041435981511,null,4,{"$f":"IF(H158<=DefaultData!$D$53,-ISPMT(DefaultData!$D$52,$H158,DefaultData!$D$53,DefaultData!$D$32*DefaultData!$D$49*DefaultData!$D$50),0)","v":0},{"$f":"IF(H158<=DefaultData!$D$53,-PPMT(DefaultData!$D$52,$H158,DefaultData!$D$53,DefaultData!$D$32*DefaultData!$D$49*DefaultData!$D$50),0)","v":0},0,null,4,{"$f":"IF(M158<=DefaultData!$D$53,-ISPMT(DefaultData!$D$52,$H158,DefaultData!$D$53,DefaultData!$D$32*DefaultData!$D$49*DefaultData!$D$51),0)","v":3.2421540455670952},{"$f":"IF(M158<=DefaultData!$D$53,-PPMT(DefaultData!$D$52,$H158,DefaultData!$D$53,DefaultData!$D$32*DefaultData!$D$49*DefaultData!$D$51),0)","v":3.6050342888610496},6.8471883344281448]
[null,null,5,{"$f":"IF(C159<=DefaultData!D$45,-ISPMT(DefaultData!D$46,C159,DefaultData!D$45,DefaultData!D$30*DefaultData!D$44),0)","v":0.79345500000000002},{"$f":"IF(C159<=DefaultData!D$45,-PPMT(DefaultData!D$46,C159,DefaultData!D$45,DefaultData!D$44*DefaultData!D$30),0)","v":0.27043735795796614},1.0638923579579662,null,5,{"$f":"IF(H159<=DefaultData!$D$53,-ISPMT(DefaultData!$D$52,$H159,DefaultData!$D$53,DefaultData!$D$32*DefaultData!$D$49*DefaultData!$D$50),0)","v":0},{"$f":"IF(H159<=DefaultData!$D$53,-PPMT(DefaultData!$D$52,$H159,DefaultData!$D$53,DefaultData!$D$32*DefaultData!$D$49*DefaultData!$D$50),0)","v":0},0,null,5,{"$f":"IF(M159<=DefaultData!$D$53,-ISPMT(DefaultData!$D$52,$H159,DefaultData!$D$53,DefaultData!$D$32*DefaultData!$D$49*DefaultData!$D$51),0)","v":2.7017950379725795},{"$f":"IF(M159<=DefaultData!$D$53,-PPMT(DefaultData!$D$52,$H159,DefaultData!$D$53,DefaultData!$D$32*DefaultData!$D$49*DefaultData!$D$51),0)","v":4.037638403524376},6.7394334414969554]
[null,null,6,{"$f":"IF(C160<=DefaultData!D$45,-ISPMT(DefaultData!D$46,C160,DefaultData!D$45,DefaultData!D$30*DefaultData!D$44),0)","v":0.74055800000000005},{"$f":"IF(C160<=DefaultData!D$45,-PPMT(DefaultData!D$46,C160,DefaultData!D$45,DefaultData!D$44*DefaultData!D$30),0)","v":0.29748109375376269},1.0380390937537627,null,6,{"$f":"IF(H160<=DefaultData!$D$53,-ISPMT(DefaultData!$D$52,$H160,DefaultData!$D$53,DefaultData!$D$32*DefaultData!$D$49*DefaultData!$D$50),0)","v":0},{"$f":"IF(H160<=DefaultData!$D$53,-PPMT(DefaultData!$D$52,$H160,DefaultData!$D$53,DefaultData!$D$32*DefaultData!$D$49*DefaultData!$D$50),0)","v":0},0,null,6,{"$f":"IF(M160<=DefaultData!$D$53,-ISPMT(DefaultData!$D$52,$H160,DefaultData!$D$53,DefaultData!$D$32*DefaultData!$D$49*DefaultData!$D$51),0)","v":2.1614360303780638},{"$f":"IF(M160<=DefaultData!$D$53,-PPMT(DefaultData!$D$52,$H160,DefaultData!$D$53,DefaultData!$D$32*DefaultData!$D$49*DefaultData!$D$51),0)","v":4.5221550119472997},6.6835910423253635]
[null,null,7,{"$f":"IF(C161<=DefaultData!D$45,-ISPMT(DefaultData!D$46,C161,DefaultData!D$45,DefaultData!D$30*DefaultData!D$44),0)","v":0.68766099999999997},{"$f":"IF(C161<=DefaultData!D$45,-PPMT(DefaultData!D$46,C161,DefaultData!D$45,DefaultData!D$44*DefaultData!D$30),0)","v":0.32722920312913906},1.0148902031291391,null,7,{"$f":"IF(H161<=DefaultData!$D$53,-ISPMT(DefaultData!$D$52,$H161,DefaultData!$D$53,DefaultData!$D$32*DefaultData!$D$49*DefaultData!$D$50),0)","v":0},{"$f":"IF(H161<=DefaultData!$D$53,-PPMT(DefaultData!$D$52,$H161,DefaultData!$D$53,DefaultData!$D$32*DefaultData!$D$49*DefaultData!$D$50),0)","v":0},0,null,7,{"$f":"IF(M161<=DefaultData!$D$53,-ISPMT(DefaultData!$D$52,$H161,DefaultData!$D$53,DefaultData!$D$32*DefaultData!$D$49*DefaultData!$D$51),0)","v":1.6210770227835476},{"$f":"IF(M161<=DefaultData!$D$53,-PPMT(DefaultData!$D$52,$H161,DefaultData!$D$53,DefaultData!$D$32*DefaultData!$D$49*DefaultData!$D$51),0)","v":5.0648136133809762},6.6858906361645243]
[null,null,8,{"$f":"IF(C162<=DefaultData!D$45,-ISPMT(DefaultData!D$46,C162,DefaultData!D$45,DefaultData!D$30*DefaultData!D$44),0)","v":0.63476399999999999},{"$f":"IF(C162<=DefaultData!D$45,-PPMT(DefaultData!D$46,C162,DefaultData!D$45,DefaultData!D$44*DefaultData!D$30),0)","v":0.35995212344205285},0.99471612344205285,null,8,{"$f":"IF(H162<=DefaultData!$D$53,-ISPMT(DefaultData!$D$52,$H162,DefaultData!$D$53,DefaultData!$D$32*DefaultData!$D$49*DefaultData!$D$50),0)","v":0},{"$f":"IF(H162<=DefaultData!$D$53,-PPMT(DefaultData!$D$52,$H162,DefaultData!$D$53,DefaultData!$D$32*DefaultData!$D$49*DefaultData!$D$50),0)","v":0},0,null,8,{"$f":"IF(M162<=DefaultData!$D$53,-ISPMT(DefaultData!$D$52,$H162,DefaultData!$D$53,DefaultData!$D$32*DefaultData!$D$49*DefaultData!$D$51),0)","v":1.0807180151890319},{"$f":"IF(M162<=DefaultData!$D$53,-PPMT(DefaultData!$D$52,$H162,DefaultData!$D$53,DefaultData!$D$32*DefaultData!$D$49*DefaultData!$D$51),0)","v":5.6725912469866939},6.7533092621757262]
[null,null,9,{"$f":"IF(C163<=DefaultData!D$45,-ISPMT(DefaultData!D$46,C163,DefaultData!D$45,DefaultData!D$30*DefaultData!D$44),0)","v":0.58186700000000013},{"$f":"IF(C163<=DefaultData!D$45,-PPMT(DefaultData!D$46,C163,DefaultData!D$45,DefaultData!D$44*DefaultData!D$30),0)","v":0.39594733578625824},0.97781433578625832,null,9,{"$f":"IF(H163<=DefaultData!$D$53,-ISPMT(DefaultData!$D$52,$H163,DefaultData!$D$53,DefaultData!$D$32*DefaultData!$D$49*DefaultData!$D$50),0)","v":0},{"$f":"IF(H163<=DefaultData!$D$53,-PPMT(DefaultData!$D$52,$H163,DefaultData!$D$53,DefaultData!$D$32*DefaultData!$D$49*DefaultData!$D$50),0)","v":0},0,null,9,{"$f":"IF(M163<=DefaultData!$D$53,-ISPMT(DefaultData!$D$52,$H163,DefaultData!$D$53,DefaultData!$D$32*DefaultData!$D$49*DefaultData!$D$51),0)","v":0.54035900759451594},{"$f":"IF(M163<=DefaultData!$D$53,-PPMT(DefaultData!$D$52,$H163,DefaultData!$D$53,DefaultData!$D$32*DefaultData!$D$49*DefaultData!$D$51),0)","v":6.3533021966250969},6.8936612042196126]
[null,null,10,{"$f":"IF(C164<=DefaultData!D$45,-ISPMT(DefaultData!D$46,C164,DefaultData!D$45,DefaultData!D$30*DefaultData!D$44),0)","v":0.52896999999999994},{"$f":"IF(C164<=DefaultData!D$45,-PPMT(DefaultData!D$46,C164,DefaultData!D$45,DefaultData!D$44*DefaultData!D$30),0)","v":0.43554206936488393},0.96451206936488387,null,10,{"$f":"IF(H164<=DefaultData!$D$53,-ISPMT(DefaultData!$D$52,$H164,DefaultData!$D$53,DefaultData!$D$32*DefaultData!$D$49*DefaultData!$D$50),0)","v":0},{"$f":"IF(H164<=DefaultData!$D$53,-PPMT(DefaultData!$D$52,$H164,DefaultData!$D$53,DefaultData!$D$32*DefaultData!$D$49*DefaultData!$D$50),0)","v":0},0,null,10,{"$f":"IF(M164<=DefaultData!$D$53,-ISPMT(DefaultData!$D$52,$H164,DefaultData!$D$53,DefaultData!$D$32*DefaultData!$D$49*DefaultData!$D$51),0)","v":0},{"$f":"IF(M164<=DefaultData!$D$53,-PPMT(DefaultData!$D$52,$H164,DefaultData!$D$53,DefaultData!$D$32*DefaultData!$D$49*DefaultData!$D$51),0)","v":7.1156984602201083},7.1156984602201083]
[null,null,11,{"$f":"IF(C165<=DefaultData!D$45,-ISPMT(DefaultData!D$46,C165,DefaultData!D$45,DefaultData!D$30*DefaultData!D$44),0)","v":0.47607299999999997},{"$f":"IF(C165<=DefaultData!D$45,-PPMT(DefaultData!D$46,C165,DefaultData!D$45,DefaultData!D$44*DefaultData!D$30),0)","v":0.4790962763013723},0.95516927630137227,null,11,{"$f":"IF(H165<=DefaultData!$D$53,-ISPMT(DefaultData!$D$52,$H165,DefaultData!$D$53,DefaultData!$D$32*DefaultData!$D$49*DefaultData!$D$50),0)","v":0},{"$f":"IF(H165<=DefaultData!$D$53,-PPMT(DefaultData!$D$52,$H165,DefaultData!$D$53,DefaultData!$D$32*DefaultData!$D$49*DefaultData!$D$50),0)","v":0},0,null,11,{"$f":"IF(M165<=DefaultData!$D$53,-ISPMT(DefaultData!$D$52,$H165,DefaultData!$D$53,DefaultData!$D$32*DefaultData!$D$49*DefaultData!$D$51),0)","v":0},{"$f":"IF(M165<=DefaultData!$D$53,-PPMT(DefaultData!$D$52,$H165,DefaultData!$D$53,DefaultData!$D$32*DefaultData!$D$49*DefaultData!$D$51),0)","v":0},0]
[null,null,12,{"$f":"IF(C166<=DefaultData!D$45,-ISPMT(DefaultData!D$46,C166,DefaultData!D$45,DefaultData!D$30*DefaultData!D$44),0)","v":0.42317600000000005},{"$f":"IF(C166<=DefaultData!D$45,-PPMT(DefaultData!D$46,C166,DefaultData!D$45,DefaultData!D$44*DefaultData!D$30),0)","v":0.52700590393150959},0.95018190393150959,null,12,{"$f":"IF(H166<=DefaultData!$D$53,-ISPMT(DefaultData!$D$52,$H166,DefaultData!$D$53,DefaultData!$D$32*DefaultData!$D$49*DefaultData!$D$50),0)","v":0},{"$f":"IF(H166<=DefaultData!$D$53,-PPMT(DefaultData!$D$52,$H166,DefaultData!$D$53,DefaultData!$D$32*DefaultData!$D$49*DefaultData!$D$50),0)","v":0},0,null,12,{"$f":"IF(M166<=DefaultData!$D$53,-ISPMT(DefaultData!$D$52,$H166,DefaultData!$D$53,DefaultData!$D$32*DefaultData!$D$49*DefaultData!$D$51),0)","v":0},{"$f":"IF(M166<=DefaultData!$D$53,-PPMT(DefaultData!$D$52,$H166,DefaultData!$D$53,DefaultData!$D$32*DefaultData!$D$49*DefaultData!$D$51),0)","v":0},0]
[null,null,13,{"$f":"IF(C167<=DefaultData!D$45,-ISPMT(DefaultData!D$46,C167,DefaultData!D$45,DefaultData!D$30*DefaultData!D$44),0)","v":0.37027900000000002},{"$f":"IF(C167<=DefaultData!D$45,-PPMT(DefaultData!D$46,C167,DefaultData!D$45,DefaultData!D$44*DefaultData!D$30),0)","v":0.57970649432466048},0.94998549432466051,null,13,{"$f":"IF(H167<=DefaultData!$D$53,-ISPMT(DefaultData!$D$52,$H167,DefaultData!$D$53,DefaultData!$D$32*DefaultData!$D$49*DefaultData!$D$50),0)","v":0},{"$f":"IF(H167<=DefaultData!$D$53,-PPMT(DefaultData!$D$52,$H167,DefaultData!$D$53,DefaultData!$D$32*DefaultData!$D$49*DefaultData!$D$50),0)","v":0},0,null,13,{"$f":"IF(M167<=DefaultData!$D$53,-ISPMT(DefaultData!$D$52,$H167,DefaultData!$D$53,DefaultData!$D$32*DefaultData!$D$49*DefaultData!$D$51),0)","v":0},{"$f":"IF(M167<=DefaultData!$D$53,-PPMT(DefaultData!$D$52,$H167,DefaultData!$D$53,DefaultData!$D$32*DefaultData!$D$49*DefaultData!$D$51),0)","v":0},0]
[null,null,14,{"$f":"IF(C168<=DefaultData!D$45,-ISPMT(DefaultData!D$46,C168,DefaultData!D$45,DefaultData!D$30*DefaultData!D$44),0)","v":0.317382},{"$f":"IF(C168<=DefaultData!D$45,-PPMT(DefaultData!D$46,C168,DefaultData!D$45,DefaultData!D$44*DefaultData!D$30),0)","v":0.6376771437571267},0.95505914375712675,null,14,{"$f":"IF(H168<=DefaultData!$D$53,-ISPMT(DefaultData!$D$52,$H168,DefaultData!$D$53,DefaultData!$D$32*DefaultData!$D$49*DefaultData!$D$50),0)","v":0},{"$f":"IF(H168<=DefaultData!$D$53,-PPMT(DefaultData!$D$52,$H168,DefaultData!$D$53,DefaultData!$D$32*DefaultData!$D$49*DefaultData!$D$50),0)","v":0},0,null,14,{"$f":"IF(M168<=DefaultData!$D$53,-ISPMT(DefaultData!$D$52,$H168,DefaultData!$D$53,DefaultData!$D$32*DefaultData!$D$49*DefaultData!$D$51),0)","v":0},{"$f":"IF(M168<=DefaultData!$D$53,-PPMT(DefaultData!$D$52,$H168,DefaultData!$D$53,DefaultData!$D$32*DefaultData!$D$49*DefaultData!$D$51),0)","v":0},0]
[null,null,15,{"$f":"IF(C169<=DefaultData!D$45,-ISPMT(DefaultData!D$46,C169,DefaultData!D$45,DefaultData!D$30*DefaultData!D$44),0)","v":0.26448499999999997},{"$f":"IF(C169<=DefaultData!D$45,-PPMT(DefaultData!D$46,C169,DefaultData!D$45,DefaultData!D$44*DefaultData!D$30),0)","v":0.7014448581328393},0.96592985813283927,null,15,{"$f":"IF(H169<=DefaultData!$D$53,-ISPMT(DefaultData!$D$52,$H169,DefaultData!$D$53,DefaultData!$D$32*DefaultData!$D$49*DefaultData!$D$50),0)","v":0},{"$f":"IF(H169<=DefaultData!$D$53,-PPMT(DefaultData!$D$52,$H169,DefaultData!$D$53,DefaultData!$D$32*DefaultData!$D$49*DefaultData!$D$50),0)","v":0},0,null,15,{"$f":"IF(M169<=DefaultData!$D$53,-ISPMT(DefaultData!$D$52,$H169,DefaultData!$D$53,DefaultData!$D$32*DefaultData!$D$49*DefaultData!$D$51),0)","v":0},{"$f":"IF(M169<=DefaultData!$D$53,-PPMT(DefaultData!$D$52,$H169,DefaultData!$D$53,DefaultData!$D$32*DefaultData!$D$49*DefaultData!$D$51),0)","v":0},0]
[null,null,16,{"$f":"IF(C170<=DefaultData!D$45,-ISPMT(DefaultData!D$46,C170,DefaultData!D$45,DefaultData!D$30*DefaultData!D$44),0)","v":0.21158800000000003},{"$f":"IF(C170<=DefaultData!D$45,-PPMT(DefaultData!D$46,C170,DefaultData!D$45,DefaultData!D$44*DefaultData!D$30),0)","v":0.77158934394612322},0.98317734394612322,null,16,{"$f":"IF(H170<=DefaultData!$D$53,-ISPMT(DefaultData!$D$52,$H170,DefaultData!$D$53,DefaultData!$D$32*DefaultData!$D$49*DefaultData!$D$50),0)","v":0},{"$f":"IF(H170<=DefaultData!$D$53,-PPMT(DefaultData!$D$52,$H170,DefaultData!$D$53,DefaultData!$D$32*DefaultData!$D$49*DefaultData!$D$50),0)","v":0},0,null,16,{"$f":"IF(M170<=DefaultData!$D$53,-ISPMT(DefaultData!$D$52,$H170,DefaultData!$D$53,DefaultData!$D$32*DefaultData!$D$49*DefaultData!$D$51),0)","v":0},{"$f":"IF(M170<=DefaultData!$D$53,-PPMT(DefaultData!$D$52,$H170,DefaultData!$D$53,DefaultData!$D$32*DefaultData!$D$49*DefaultData!$D$51),0)","v":0},0]
[null,null,17,{"$f":"IF(C171<=DefaultData!D$45,-ISPMT(DefaultData!D$46,C171,DefaultData!D$45,DefaultData!D$30*DefaultData!D$44),0)","v":0.158691},{"$f":"IF(C171<=DefaultData!D$45,-PPMT(DefaultData!D$46,C171,DefaultData!D$45,DefaultData!D$44*DefaultData!D$30),0)","v":0.84874827834073552},1.0074392783407355,null,17,{"$f":"IF(H171<=DefaultData!$D$53,-ISPMT(DefaultData!$D$52,$H171,DefaultData!$D$53,DefaultData!$D$32*DefaultData!$D$49*DefaultData!$D$50),0)","v":0},{"$f":"IF(H171<=DefaultData!$D$53,-PPMT(DefaultData!$D$52,$H171,DefaultData!$D$53,DefaultData!$D$32*DefaultData!$D$49*DefaultData!$D$50),0)","v":0},0,null,17,{"$f":"IF(M171<=DefaultData!$D$53,-ISPMT(DefaultData!$D$52,$H171,DefaultData!$D$53,DefaultData!$D$32*DefaultData!$D$49*DefaultData!$D$51),0)","v":0},{"$f":"IF(M171<=DefaultData!$D$53,-PPMT(DefaultData!$D$52,$H171,DefaultData!$D$53,DefaultData!$D$32*DefaultData!$D$49*DefaultData!$D$51),0)","v":0},0]
[null,null,18,{"$f":"IF(C172<=DefaultData!D$45,-ISPMT(DefaultData!D$46,C172,DefaultData!D$45,DefaultData!D$30*DefaultData!D$44),0)","v":0.10579400000000001},{"$f":"IF(C172<=DefaultData!D$45,-PPMT(DefaultData!D$46,C172,DefaultData!D$45,DefaultData!D$44*DefaultData!D$30),0)","v":0.93362310617480893},1.039417106174809,null,18,{"$f":"IF(H172<=DefaultData!$D$53,-ISPMT(DefaultData!$D$52,$H172,DefaultData!$D$53,DefaultData!$D$32*DefaultData!$D$49*DefaultData!$D$50),0)","v":0},{"$f":"IF(H172<=DefaultData!$D$53,-PPMT(DefaultData!$D$52,$H172,DefaultData!$D$53,DefaultData!$D$32*DefaultData!$D$49*DefaultData!$D$50),0)","v":0},0,null,18,{"$f":"IF(M172<=DefaultData!$D$53,-ISPMT(DefaultData!$D$52,$H172,DefaultData!$D$53,DefaultData!$D$32*DefaultData!$D$49*DefaultData!$D$51),0)","v":0},{"$f":"IF(M172<=DefaultData!$D$53,-PPMT(DefaultData!$D$52,$H172,DefaultData!$D$53,DefaultData!$D$32*DefaultData!$D$49*DefaultData!$D$51),0)","v":0},0]
[null,null,19,{"$f":"IF(C173<=DefaultData!D$45,-ISPMT(DefaultData!D$46,C173,DefaultData!D$45,DefaultData!D$30*DefaultData!D$44),0)","v":5.2897000000000007E-2},{"$f":"IF(C173<=DefaultData!D$45,-PPMT(DefaultData!D$46,C173,DefaultData!D$45,DefaultData!D$44*DefaultData!D$30),0)","v":1.0269854167922901},1.07988241679229,null,19,{"$f":"IF(H173<=DefaultData!$D$53,-ISPMT(DefaultData!$D$52,$H173,DefaultData!$D$53,DefaultData!$D$32*DefaultData!$D$49*DefaultData!$D$50),0)","v":0},{"$f":"IF(H173<=DefaultData!$D$53,-PPMT(DefaultData!$D$52,$H173,DefaultData!$D$53,DefaultData!$D$32*DefaultData!$D$49*DefaultData!$D$50),0)","v":0},0,null,19,{"$f":"IF(M173<=DefaultData!$D$53,-ISPMT(DefaultData!$D$52,$H173,DefaultData!$D$53,DefaultData!$D$32*DefaultData!$D$49*DefaultData!$D$51),0)","v":0},{"$f":"IF(M173<=DefaultData!$D$53,-PPMT(DefaultData!$D$52,$H173,DefaultData!$D$53,DefaultData!$D$32*DefaultData!$D$49*DefaultData!$D$51),0)","v":0},0]
[null,null,20,{"$f":"IF(C174<=DefaultData!D$45,-ISPMT(DefaultData!D$46,C174,DefaultData!D$45,DefaultData!D$30*DefaultData!D$44),0)","v":0},{"$f":"IF(C174<=DefaultData!D$45,-PPMT(DefaultData!D$46,C174,DefaultData!D$45,DefaultData!D$44*DefaultData!D$30),0)","v":1.1296839584715188},1.1296839584715188,null,20,{"$f":"IF(H174<=DefaultData!$D$53,-ISPMT(DefaultData!$D$52,$H174,DefaultData!$D$53,DefaultData!$D$32*DefaultData!$D$49*DefaultData!$D$50),0)","v":0},{"$f":"IF(H174<=DefaultData!$D$53,-PPMT(DefaultData!$D$52,$H174,DefaultData!$D$53,DefaultData!$D$32*DefaultData!$D$49*DefaultData!$D$50),0)","v":0},0,null,20,{"$f":"IF(M174<=DefaultData!$D$53,-ISPMT(DefaultData!$D$52,$H174,DefaultData!$D$53,DefaultData!$D$32*DefaultData!$D$49*DefaultData!$D$51),0)","v":0},{"$f":"IF(M174<=DefaultData!$D$53,-PPMT(DefaultData!$D$52,$H174,DefaultData!$D$53,DefaultData!$D$32*DefaultData!$D$49*DefaultData!$D$51),0)","v":0},0]
[null,null,21,{"$f":"IF(C175<=DefaultData!D$45,-ISPMT(DefaultData!D$46,C175,DefaultData!D$45,DefaultData!D$30*DefaultData!D$44),0)","v":0},{"$f":"IF(C175<=DefaultData!D$45,-PPMT(DefaultData!D$46,C175,DefaultData!D$45,DefaultData!D$44*DefaultData!D$30),0)","v":0},0,null,21,{"$f":"IF(H175<=DefaultData!$D$53,-ISPMT(DefaultData!$D$52,$H175,DefaultData!$D$53,DefaultData!$D$32*DefaultData!$D$49*DefaultData!$D$50),0)","v":0},{"$f":"IF(H175<=DefaultData!$D$53,-PPMT(DefaultData!$D$52,$H175,DefaultData!$D$53,DefaultData!$D$32*DefaultData!$D$49*DefaultData!$D$50),0)","v":0},0,null,21,{"$f":"IF(M175<=DefaultData!$D$53,-ISPMT(DefaultData!$D$52,$H175,DefaultData!$D$53,DefaultData!$D$32*DefaultData!$D$49*DefaultData!$D$51),0)","v":0},{"$f":"IF(M175<=DefaultData!$D$53,-PPMT(DefaultData!$D$52,$H175,DefaultData!$D$53,DefaultData!$D$32*DefaultData!$D$49*DefaultData!$D$51),0)","v":0},0]
[null,null,22,{"$f":"IF(C176<=DefaultData!D$45,-ISPMT(DefaultData!D$46,C176,DefaultData!D$45,DefaultData!D$30*DefaultData!D$44),0)","v":0},{"$f":"IF(C176<=DefaultData!D$45,-PPMT(DefaultData!D$46,C176,DefaultData!D$45,DefaultData!D$44*DefaultData!D$30),0)","v":0},0,null,22,{"$f":"IF(H176<=DefaultData!$D$53,-ISPMT(DefaultData!$D$52,$H176,DefaultData!$D$53,DefaultData!$D$32*DefaultData!$D$49*DefaultData!$D$50),0)","v":0},{"$f":"IF(H176<=DefaultData!$D$53,-PPMT(DefaultData!$D$52,$H176,DefaultData!$D$53,DefaultData!$D$32*DefaultData!$D$49*DefaultData!$D$50),0)","v":0},0,null,22,{"$f":"IF(M176<=DefaultData!$D$53,-ISPMT(DefaultData!$D$52,$H176,DefaultData!$D$53,DefaultData!$D$32*DefaultData!$D$49*DefaultData!$D$51),0)","v":0},{"$f":"IF(M176<=DefaultData!$D$53,-PPMT(DefaultData!$D$52,$H176,DefaultData!$D$53,DefaultData!$D$32*DefaultData!$D$49*DefaultData!$D$51),0)","v":0},0]
[null,null,23,{"$f":"IF(C177<=DefaultData!D$45,-ISPMT(DefaultData!D$46,C177,DefaultData!D$45,DefaultData!D$30*DefaultData!D$44),0)","v":0},{"$f":"IF(C177<=DefaultData!D$45,-PPMT(DefaultData!D$46,C177,DefaultData!D$45,DefaultData!D$44*DefaultData!D$30),0)","v":0},0,null,23,{"$f":"IF(H177<=DefaultData!$D$53,-ISPMT(DefaultData!$D$52,$H177,DefaultData!$D$53,DefaultData!$D$32*DefaultData!$D$49*DefaultData!$D$50),0)","v":0},{"$f":"IF(H177<=DefaultData!$D$53,-PPMT(DefaultData!$D$52,$H177,DefaultData!$D$53,DefaultData!$D$32*DefaultData!$D$49*DefaultData!$D$50),0)","v":0},0,null,23,{"$f":"IF(M177<=DefaultData!$D$53,-ISPMT(DefaultData!$D$52,$H177,DefaultData!$D$53,DefaultData!$D$32*DefaultData!$D$49*DefaultData!$D$51),0)","v":0},{"$f":"IF(M177<=DefaultData!$D$53,-PPMT(DefaultData!$D$52,$H177,DefaultData!$D$53,DefaultData!$D$32*DefaultData!$D$49*DefaultData!$D$51),0)","v":0},0]
[null,null,24,{"$f":"IF(C178<=DefaultData!D$45,-ISPMT(DefaultData!D$46,C178,DefaultData!D$45,DefaultData!D$30*DefaultData!D$44),0)","v":0},{"$f":"IF(C178<=DefaultData!D$45,-PPMT(DefaultData!D$46,C178,DefaultData!D$45,DefaultData!D$44*DefaultData!D$30),0)","v":0},0,null,24,{"$f":"IF(H178<=DefaultData!$D$53,-ISPMT(DefaultData!$D$52,$H178,DefaultData!$D$53,DefaultData!$D$32*DefaultData!$D$49*DefaultData!$D$50),0)","v":0},{"$f":"IF(H178<=DefaultData!$D$53,-PPMT(DefaultData!$D$52,$H178,DefaultData!$D$53,DefaultData!$D$32*DefaultData!$D$49*DefaultData!$D$50),0)","v":0},0,null,24,{"$f":"IF(M178<=DefaultData!$D$53,-ISPMT(DefaultData!$D$52,$H178,DefaultData!$D$53,DefaultData!$D$32*DefaultData!$D$49*DefaultData!$D$51),0)","v":0},{"$f":"IF(M178<=DefaultData!$D$53,-PPMT(DefaultData!$D$52,$H178,DefaultData!$D$53,DefaultData!$D$32*DefaultData!$D$49*DefaultData!$D$51),0)","v":0},0]
[null,null,25,{"$f":"IF(C179<=DefaultData!D$45,-ISPMT(DefaultData!D$46,C179,DefaultData!D$45,DefaultData!D$30*DefaultData!D$44),0)","v":0},{"$f":"IF(C179<=DefaultData!D$45,-PPMT(DefaultData!D$46,C179,DefaultData!D$45,DefaultData!D$44*DefaultData!D$30),0)","v":0},0,null,25,{"$f":"IF(H179<=DefaultData!$D$53,-ISPMT(DefaultData!$D$52,$H179,DefaultData!$D$53,DefaultData!$D$32*DefaultData!$D$49*DefaultData!$D$50),0)","v":0},{"$f":"IF(H179<=DefaultData!$D$53,-PPMT(DefaultData!$D$52,$H179,DefaultData!$D$53,DefaultData!$D$32*DefaultData!$D$49*DefaultData!$D$50),0)","v":0},0,null,25,{"$f":"IF(M179<=DefaultData!$D$53,-ISPMT(DefaultData!$D$52,$H179,DefaultData!$D$53,DefaultData!$D$32*DefaultData!$D$49*DefaultData!$D$51),0)","v":0},{"$f":"IF(M179<=DefaultData!$D$53,-PPMT(DefaultData!$D$52,$H179,DefaultData!$D$53,DefaultData!$D$32*DefaultData!$D$49*DefaultData!$D$51),0)","v":0},0]
[null,null,26,{"$f":"IF(C180<=DefaultData!D$45,-ISPMT(DefaultData!D$46,C180,DefaultData!D$45,DefaultData!D$30*DefaultData!D$44),0)","v":0},{"$f":"IF(C180<=DefaultData!D$45,-PPMT(DefaultData!D$46,C180,DefaultData!D$45,DefaultData!D$44*DefaultData!D$30),0)","v":0},0,null,26,{"$f":"IF(H180<=DefaultData!$D$53,-ISPMT(DefaultData!$D$52,$H180,DefaultData!$D$53,DefaultData!$D$32*DefaultData!$D$49*DefaultData!$D$50),0)","v":0},{"$f":"IF(H180<=DefaultData!$D$53,-PPMT(DefaultData!$D$52,$H180,DefaultData!$D$53,DefaultData!$D$32*DefaultData!$D$49*DefaultData!$D$50),0)","v":0},0,null,26,{"$f":"IF(M180<=DefaultData!$D$53,-ISPMT(DefaultData!$D$52,$H180,DefaultData!$D$53,DefaultData!$D$32*DefaultData!$D$49*DefaultData!$D$51),0)","v":0},{"$f":"IF(M180<=DefaultData!$D$53,-PPMT(DefaultData!$D$52,$H180,DefaultData!$D$53,DefaultData!$D$32*DefaultData!$D$49*DefaultData!$D$51),0)","v":0},0]
[null,null,27,{"$f":"IF(C181<=DefaultData!D$45,-ISPMT(DefaultData!D$46,C181,DefaultData!D$45,DefaultData!D$30*DefaultData!D$44),0)","v":0},{"$f":"IF(C181<=DefaultData!D$45,-PPMT(DefaultData!D$46,C181,DefaultData!D$45,DefaultData!D$44*DefaultData!D$30),0)","v":0},0,null,27,{"$f":"IF(H181<=DefaultData!$D$53,-ISPMT(DefaultData!$D$52,$H181,DefaultData!$D$53,DefaultData!$D$32*DefaultData!$D$49*DefaultData!$D$50),0)","v":0},{"$f":"IF(H181<=DefaultData!$D$53,-PPMT(DefaultData!$D$52,$H181,DefaultData!$D$53,DefaultData!$D$32*DefaultData!$D$49*DefaultData!$D$50),0)","v":0},0,null,27,{"$f":"IF(M181<=DefaultData!$D$53,-ISPMT(DefaultData!$D$52,$H181,DefaultData!$D$53,DefaultData!$D$32*DefaultData!$D$49*DefaultData!$D$51),0)","v":0},{"$f":"IF(M181<=DefaultData!$D$53,-PPMT(DefaultData!$D$52,$H181,DefaultData!$D$53,DefaultData!$D$32*DefaultData!$D$49*DefaultData!$D$51),0)","v":0},0]
[null,null,28,{"$f":"IF(C182<=DefaultData!D$45,-ISPMT(DefaultData!D$46,C182,DefaultData!D$45,DefaultData!D$30*DefaultData!D$44),0)","v":0},{"$f":"IF(C182<=DefaultData!D$45,-PPMT(DefaultData!D$46,C182,DefaultData!D$45,DefaultData!D$44*DefaultData!D$30),0)","v":0},0,null,28,{"$f":"IF(H182<=DefaultData!$D$53,-ISPMT(DefaultData!$D$52,$H182,DefaultData!$D$53,DefaultData!$D$32*DefaultData!$D$49*DefaultData!$D$50),0)","v":0},{"$f":"IF(H182<=DefaultData!$D$53,-PPMT(DefaultData!$D$52,$H182,DefaultData!$D$53,DefaultData!$D$32*DefaultData!$D$49*DefaultData!$D$50),0)","v":0},0,null,28,{"$f":"IF(M182<=DefaultData!$D$53,-ISPMT(DefaultData!$D$52,$H182,DefaultData!$D$53,DefaultData!$D$32*DefaultData!$D$49*DefaultData!$D$51),0)","v":0},{"$f":"IF(M182<=DefaultData!$D$53,-PPMT(DefaultData!$D$52,$H182,DefaultData!$D$53,DefaultData!$D$32*DefaultData!$D$49*DefaultData!$D$51),0)","v":0},0]
[null,null,29,{"$f":"IF(C183<=DefaultData!D$45,-ISPMT(DefaultData!D$46,C183,DefaultData!D$45,DefaultData!D$30*DefaultData!D$44),0)","v":0},{"$f":"IF(C183<=DefaultData!D$45,-PPMT(DefaultData!D$46,C183,DefaultData!D$45,DefaultData!D$44*DefaultData!D$30),0)","v":0},0,null,29,{"$f":"IF(H183<=DefaultData!$D$53,-ISPMT(DefaultData!$D$52,$H183,DefaultData!$D$53,DefaultData!$D$32*DefaultData!$D$49*DefaultData!$D$50),0)","v":0},{"$f":"IF(H183<=DefaultData!$D$53,-PPMT(DefaultData!$D$52,$H183,DefaultData!$D$53,DefaultData!$D$32*DefaultData!$D$49*DefaultData!$D$50),0)","v":0},0,null,29,{"$f":"IF(M183<=DefaultData!$D$53,-ISPMT(DefaultData!$D$52,$H183,DefaultData!$D$53,DefaultData!$D$32*DefaultData!$D$49*DefaultData!$D$51),0)","v":0},{"$f":"IF(M183<=DefaultData!$D$53,-PPMT(DefaultData!$D$52,$H183,DefaultData!$D$53,DefaultData!$D$32*DefaultData!$D$49*DefaultData!$D$51),0)","v":0},0]
[null,null,30,{"$f":"IF(C184<=DefaultData!D$45,-ISPMT(DefaultData!D$46,C184,DefaultData!D$45,DefaultData!D$30*DefaultData!D$44),0)","v":0},{"$f":"IF(C184<=DefaultData!D$45,-PPMT(DefaultData!D$46,C184,DefaultData!D$45,DefaultData!D$44*DefaultData!D$30),0)","v":0},0,null,30,{"$f":"IF(H184<=DefaultData!$D$53,-ISPMT(DefaultData!$D$52,$H184,DefaultData!$D$53,DefaultData!$D$32*DefaultData!$D$49*DefaultData!$D$50),0)","v":0},{"$f":"IF(H184<=DefaultData!$D$53,-PPMT(DefaultData!$D$52,$H184,DefaultData!$D$53,DefaultData!$D$32*DefaultData!$D$49*DefaultData!$D$50),0)","v":0},0,null,30,{"$f":"IF(M184<=DefaultData!$D$53,-ISPMT(DefaultData!$D$52,$H184,DefaultData!$D$53,DefaultData!$D$32*DefaultData!$D$49*DefaultData!$D$51),0)","v":0},{"$f":"IF(M184<=DefaultData!$D$53,-PPMT(DefaultData!$D$52,$H184,DefaultData!$D$53,DefaultData!$D$32*DefaultData!$D$49*DefaultData!$D$51),0)","v":0},0]
[null,null,"Total",{"$f":"SUM(D155:D184)","v":10.05043},{"$f":"SUM(E155:E184)","v":10.579399999999998},20.629829999999998,null,"Total",{"$f":"SUM(I155:I184)","v":0},{"$f":"SUM(J155:J184)","v":0},0,null,"Total",{"$f":"SUM(N155:N184)","v":24.316155341753216},{"$f":"SUM(O155:O184)","v":45.029917299543001},69.346072641296217]
[null,null,"AvgAnn",{"$f":"D185/DefaultData!$D45","v":0.50252150000000007},{"$f":"E185/DefaultData!$D45","v":0.52896999999999994},1.0314915,null,"AvgAnn",{"$f":"I185/ProjectData!$B$67","v":0},{"$f":"J185/ProjectData!$B$67","v":0},0,null,"AvgAnn",{"$f":"N185/ProjectData!$B$67","v":2.4316155341753216},{"$f":"O185/ProjectData!$B$67","v":4.5029917299543003},6.9346072641296219]
[]
[null,null,"User Modified (from Project Data worksheet - based on loan parameters)",null,null,null,null,"User Modified (from Project Data worksheet - based on equity investment parameters)",null,null,null,null,"User Modified (from Project Data worksheet - based on equity investment parameters)"]
[null,null,"Loan Repayment Schedule",null,null,null,null,"Equity - Individual Investment Repayment Schedule",null,null,null,null,"Equity - Corporate Investment Repayment Schedule"]
[null,null,null,"Interest Pmt","Principal Pmt","Total Pmt",null,null,"Interest Pmt","Principal Pmt","Total Pmt",null,null,"Interest Pmt","Principal Pmt","Total Pmt"]
[null,null,1,{"$f":"IF(C191<=ProjectData!B$60,-ISPMT(ProjectData!B$61,C191,ProjectData!B$60,ProjectData!B$59*ProjectData!B$43),0)","v":1.0050430000000001},{"$f":"IF(C191<=ProjectData!B$60,-PPMT(ProjectData!B$61,C191,ProjectData!B$60,ProjectData!B$43*ProjectData!B$59),0)","v":0.18471235431867092},{"$f":"E191+D191","v":1.189755354318671},null,1,{"$f":"IF($H191<=ProjectData!$B$67,-ISPMT(ProjectData!$B$66,$H191,ProjectData!$B$67,(ProjectData!$B$45*10^6)*ProjectData!$B$63*ProjectData!$B$64),0)","v":0},{"$f":"IF($H191<=ProjectData!$B$67,-PPMT(ProjectData!$B$66,$H191,ProjectData!$B$67,(ProjectData!$B$45*10^6)*ProjectData!$B$63*ProjectData!$B$64),0)","v":0},{"$f":"J191+I191","v":0},null,1,{"$f":"IF($H191<=ProjectData!$B$67,-ISPMT(ProjectData!$B$66,$H191,ProjectData!$B$67,(ProjectData!$B$45*10^6)*ProjectData!$B$63*ProjectData!$B$65),0)","v":4863231.0683506439},{"$f":"IF($H191<=ProjectData!$B$67,-PPMT(ProjectData!$B$66,$H191,ProjectData!$B$67,(ProjectData!$B$45*10^6)*ProjectData!$B$63*ProjectData!$B$65),0)","v":2565992.1995013617},{"$f":"O191+N191","v":7429223.2678520055}]
[null,null,2,{"$f":"IF(C192<=ProjectData!B$60,-ISPMT(ProjectData!B$61,C192,ProjectData!B$60,ProjectData!B$59*ProjectData!B$43),0)","v":0.95214599999999994},{"$f":"IF(C192<=ProjectData!B$60,-PPMT(ProjectData!B$61,C192,ProjectData!B$60,ProjectData!B$43*ProjectData!B$59),0)","v":0.20318358975053805},1.155329589750538,null,2,{"$f":"IF($H192<=ProjectData!$B$67,-ISPMT(ProjectData!$B$66,$H192,ProjectData!$B$67,(ProjectData!$B$45*10^6)*ProjectData!$B$63*ProjectData!$B$64),0)","v":0},{"$f":"IF($H192<=ProjectData!$B$67,-PPMT(ProjectData!$B$66,$H192,ProjectData!$B$67,(ProjectData!$B$45*10^6)*ProjectData!$B$63*ProjectData!$B$64),0)","v":0},0,null,2,{"$f":"IF($H192<=ProjectData!$B$67,-ISPMT(ProjectData!$B$66,$H192,ProjectData!$B$67,(ProjectData!$B$45*10^6)*ProjectData!$B$63*ProjectData!$B$65),0)","v":4322872.0607561274},{"$f":"IF($H192<=ProjectData!$B$67,-PPMT(ProjectData!$B$66,$H192,ProjectData!$B$67,(ProjectData!$B$45*10^6)*ProjectData!$B$63*ProjectData!$B$65),0)","v":2873911.2634415254},7196783.3241976527]
[null,null,3,{"$f":"IF(C193<=ProjectData!B$60,-ISPMT(ProjectData!B$61,C193,ProjectData!B$60,ProjectData!B$59*ProjectData!B$43),0)","v":0.89924899999999997},{"$f":"IF(C193<=ProjectData!B$60,-PPMT(ProjectData!B$61,C193,ProjectData!B$60,ProjectData!B$43*ProjectData!B$59),0)","v":0.22350194872559181},1.1227509487255918,null,3,{"$f":"IF($H193<=ProjectData!$B$67,-ISPMT(ProjectData!$B$66,$H193,ProjectData!$B$67,(ProjectData!$B$45*10^6)*ProjectData!$B$63*ProjectData!$B$64),0)","v":0},{"$f":"IF($H193<=ProjectData!$B$67,-PPMT(ProjectData!$B$66,$H193,ProjectData!$B$67,(ProjectData!$B$45*10^6)*ProjectData!$B$63*ProjectData!$B$64),0)","v":0},0,null,3,{"$f":"IF($H193<=ProjectData!$B$67,-ISPMT(ProjectData!$B$66,$H193,ProjectData!$B$67,(ProjectData!$B$45*10^6)*ProjectData!$B$63*ProjectData!$B$65),0)","v":3782513.0531616108},{"$f":"IF($H193<=ProjectData!$B$67,-PPMT(ProjectData!$B$66,$H193,ProjectData!$B$67,(ProjectData!$B$45*10^6)*ProjectData!$B$63*ProjectData!$B$65),0)","v":3218780.6150545082},7001293.6682161186]
[null,null,4,{"$f":"IF(C194<=ProjectData!B$60,-ISPMT(ProjectData!B$61,C194,ProjectData!B$60,ProjectData!B$59*ProjectData!B$43),0)","v":0.8463520000000001},{"$f":"IF(C194<=ProjectData!B$60,-PPMT(ProjectData!B$61,C194,ProjectData!B$60,ProjectData!B$43*ProjectData!B$59),0)","v":0.24585214359815102},1.0922041435981511,null,4,{"$f":"IF($H194<=ProjectData!$B$67,-ISPMT(ProjectData!$B$66,$H194,ProjectData!$B$67,(ProjectData!$B$45*10^6)*ProjectData!$B$63*ProjectData!$B$64),0)","v":0},{"$f":"IF($H194<=ProjectData!$B$67,-PPMT(ProjectData!$B$66,$H194,ProjectData!$B$67,(ProjectData!$B$45*10^6)*ProjectData!$B$63*ProjectData!$B$64),0)","v":0},0,null,4,{"$f":"IF($H194<=ProjectData!$B$67,-ISPMT(ProjectData!$B$66,$H194,ProjectData!$B$67,(ProjectData!$B$45*10^6)*ProjectData!$B$63*ProjectData!$B$65),0)","v":3242154.0455670953},{"$f":"IF($H194<=ProjectData!$B$67,-PPMT(ProjectData!$B$66,$H194,ProjectData!$B$67,(ProjectData!$B$45*10^6)*ProjectData!$B$63*ProjectData!$B$65),0)","v":3605034.2888610498},6847188.3344281446]
[null,null,5,{"$f":"IF(C195<=ProjectData!B$60,-ISPMT(ProjectData!B$61,C195,ProjectData!B$60,ProjectData!B$59*ProjectData!B$43),0)","v":0.79345500000000002},{"$f":"IF(C195<=ProjectData!B$60,-PPMT(ProjectData!B$61,C195,ProjectData!B$60,ProjectData!B$43*ProjectData!B$59),0)","v":0.27043735795796614},1.0638923579579662,null,5,{"$f":"IF($H195<=ProjectData!$B$67,-ISPMT(ProjectData!$B$66,$H195,ProjectData!$B$67,(ProjectData!$B$45*10^6)*ProjectData!$B$63*ProjectData!$B$64),0)","v":0},{"$f":"IF($H195<=ProjectData!$B$67,-PPMT(ProjectData!$B$66,$H195,ProjectData!$B$67,(ProjectData!$B$45*10^6)*ProjectData!$B$63*ProjectData!$B$64),0)","v":0},0,null,5,{"$f":"IF($H195<=ProjectData!$B$67,-ISPMT(ProjectData!$B$66,$H195,ProjectData!$B$67,(ProjectData!$B$45*10^6)*ProjectData!$B$63*ProjectData!$B$65),0)","v":2701795.0379725797},{"$f":"IF($H195<=ProjectData!$B$67,-PPMT(ProjectData!$B$66,$H195,ProjectData!$B$67,(ProjectData!$B$45*10^6)*ProjectData!$B$63*ProjectData!$B$65),0)","v":4037638.4035243746},6739433.4414969543]
[null,null,6,{"$f":"IF(C196<=ProjectData!B$60,-ISPMT(ProjectData!B$61,C196,ProjectData!B$60,ProjectData!B$59*ProjectData!B$43),0)","v":0.74055800000000005},{"$f":"IF(C196<=ProjectData!B$60,-PPMT(ProjectData!B$61,C196,ProjectData!B$60,ProjectData!B$43*ProjectData!B$59),0)","v":0.29748109375376269},1.0380390937537627,null,6,{"$f":"IF($H196<=ProjectData!$B$67,-ISPMT(ProjectData!$B$66,$H196,ProjectData!$B$67,(ProjectData!$B$45*10^6)*ProjectData!$B$63*ProjectData!$B$64),0)","v":0},{"$f":"IF($H196<=ProjectData!$B$67,-PPMT(ProjectData!$B$66,$H196,ProjectData!$B$67,(ProjectData!$B$45*10^6)*ProjectData!$B$63*ProjectData!$B$64),0)","v":0},0,null,6,{"$f":"IF($H196<=ProjectData!$B$67,-ISPMT(ProjectData!$B$66,$H196,ProjectData!$B$67,(ProjectData!$B$45*10^6)*ProjectData!$B$63*ProjectData!$B$65),0)","v":2161436.0303780637},{"$f":"IF($H196<=ProjectData!$B$67,-PPMT(ProjectData!$B$66,$H196,ProjectData!$B$67,(ProjectData!$B$45*10^6)*ProjectData!$B$63*ProjectData!$B$65),0)","v":4522155.0119473003},6683591.0423253644]
[null,null,7,{"$f":"IF(C197<=ProjectData!B$60,-ISPMT(ProjectData!B$61,C197,ProjectData!B$60,ProjectData!B$59*ProjectData!B$43),0)","v":0.68766099999999997},{"$f":"IF(C197<=ProjectData!B$60,-PPMT(ProjectData!B$61,C197,ProjectData!B$60,ProjectData!B$43*ProjectData!B$59),0)","v":0.32722920312913906},1.0148902031291391,null,7,{"$f":"IF($H197<=ProjectData!$B$67,-ISPMT(ProjectData!$B$66,$H197,ProjectData!$B$67,(ProjectData!$B$45*10^6)*ProjectData!$B$63*ProjectData!$B$64),0)","v":0},{"$f":"IF($H197<=ProjectData!$B$67,-PPMT(ProjectData!$B$66,$H197,ProjectData!$B$67,(ProjectData!$B$45*10^6)*ProjectData!$B$63*ProjectData!$B$64),0)","v":0},0,null,7,{"$f":"IF($H197<=ProjectData!$B$67,-ISPMT(ProjectData!$B$66,$H197,ProjectData!$B$67,(ProjectData!$B$45*10^6)*ProjectData!$B$63*ProjectData!$B$65),0)","v":1621077.0227835476},{"$f":"IF($H197<=ProjectData!$B$67,-PPMT(ProjectData!$B$66,$H197,ProjectData!$B$67,(ProjectData!$B$45*10^6)*ProjectData!$B$63*ProjectData!$B$65),0)","v":5064813.6133809751},6685890.6361645227]
[null,null,8,{"$f":"IF(C198<=ProjectData!B$60,-ISPMT(ProjectData!B$61,C198,ProjectData!B$60,ProjectData!B$59*ProjectData!B$43),0)","v":0.63476399999999999},{"$f":"IF(C198<=ProjectData!B$60,-PPMT(ProjectData!B$61,C198,ProjectData!B$60,ProjectData!B$43*ProjectData!B$59),0)","v":0.35995212344205285},0.99471612344205285,null,8,{"$f":"IF($H198<=ProjectData!$B$67,-ISPMT(ProjectData!$B$66,$H198,ProjectData!$B$67,(ProjectData!$B$45*10^6)*ProjectData!$B$63*ProjectData!$B$64),0)","v":0},{"$f":"IF($H198<=ProjectData!$B$67,-PPMT(ProjectData!$B$66,$H198,ProjectData!$B$67,(ProjectData!$B$45*10^6)*ProjectData!$B$63*ProjectData!$B$64),0)","v":0},0,null,8,{"$f":"IF($H198<=ProjectData!$B$67,-ISPMT(ProjectData!$B$66,$H198,ProjectData!$B$67,(ProjectData!$B$45*10^6)*ProjectData!$B$63*ProjectData!$B$65),0)","v":1080718.0151890318},{"$f":"IF($H198<=ProjectData!$B$67,-PPMT(ProjectData!$B$66,$H198,ProjectData!$B$67,(ProjectData!$B$45*10^6)*ProjectData!$B$63*ProjectData!$B$65),0)","v":5672591.2469866928},6753309.2621757248]
[null,null,9,{"$f":"IF(C199<=ProjectData!B$60,-ISPMT(ProjectData!B$61,C199,ProjectData!B$60,ProjectData!B$59*ProjectData!B$43),0)","v":0.58186700000000013},{"$f":"IF(C199<=ProjectData!B$60,-PPMT(ProjectData!B$61,C199,ProjectData!B$60,ProjectData!B$43*ProjectData!B$59),0)","v":0.39594733578625824},0.97781433578625832,null,9,{"$f":"IF($H199<=ProjectData!$B$67,-ISPMT(ProjectData!$B$66,$H199,ProjectData!$B$67,(ProjectData!$B$45*10^6)*ProjectData!$B$63*ProjectData!$B$64),0)","v":0},{"$f":"IF($H199<=ProjectData!$B$67,-PPMT(ProjectData!$B$66,$H199,ProjectData!$B$67,(ProjectData!$B$45*10^6)*ProjectData!$B$63*ProjectData!$B$64),0)","v":0},0,null,9,{"$f":"IF($H199<=ProjectData!$B$67,-ISPMT(ProjectData!$B$66,$H199,ProjectData!$B$67,(ProjectData!$B$45*10^6)*ProjectData!$B$63*ProjectData!$B$65),0)","v":540359.00759451592},{"$f":"IF($H199<=ProjectData!$B$67,-PPMT(ProjectData!$B$66,$H199,ProjectData!$B$67,(ProjectData!$B$45*10^6)*ProjectData!$B$63*ProjectData!$B$65),0)","v":6353302.1966250958},6893661.2042196114]
[null,null,10,{"$f":"IF(C200<=ProjectData!B$60,-ISPMT(ProjectData!B$61,C200,ProjectData!B$60,ProjectData!B$59*ProjectData!B$43),0)","v":0.52896999999999994},{"$f":"IF(C200<=ProjectData!B$60,-PPMT(ProjectData!B$61,C200,ProjectData!B$60,ProjectData!B$43*ProjectData!B$59),0)","v":0.43554206936488393},0.96451206936488387,null,10,{"$f":"IF($H200<=ProjectData!$B$67,-ISPMT(ProjectData!$B$66,$H200,ProjectData!$B$67,(ProjectData!$B$45*10^6)*ProjectData!$B$63*ProjectData!$B$64),0)","v":0},{"$f":"IF($H200<=ProjectData!$B$67,-PPMT(ProjectData!$B$66,$H200,ProjectData!$B$67,(ProjectData!$B$45*10^6)*ProjectData!$B$63*ProjectData!$B$64),0)","v":0},0,null,10,{"$f":"IF($H200<=ProjectData!$B$67,-ISPMT(ProjectData!$B$66,$H200,ProjectData!$B$67,(ProjectData!$B$45*10^6)*ProjectData!$B$63*ProjectData!$B$65),0)","v":0},{"$f":"IF($H200<=ProjectData!$B$67,-PPMT(ProjectData!$B$66,$H200,ProjectData!$B$67,(ProjectData!$B$45*10^6)*ProjectData!$B$63*ProjectData!$B$65),0)","v":7115698.4602201078},7115698.4602201078]
[null,null,11,{"$f":"IF(C201<=ProjectData!B$60,-ISPMT(ProjectData!B$61,C201,ProjectData!B$60,ProjectData!B$59*ProjectData!B$43),0)","v":0.47607299999999997},{"$f":"IF(C201<=ProjectData!B$60,-PPMT(ProjectData!B$61,C201,ProjectData!B$60,ProjectData!B$43*ProjectData!B$59),0)","v":0.4790962763013723},0.95516927630137227,null,11,{"$f":"IF($H201<=ProjectData!$B$67,-ISPMT(ProjectData!$B$66,$H201,ProjectData!$B$67,(ProjectData!$B$45*10^6)*ProjectData!$B$63*ProjectData!$B$64),0)","v":0},{"$f":"IF($H201<=ProjectData!$B$67,-PPMT(ProjectData!$B$66,$H201,ProjectData!$B$67,(ProjectData!$B$45*10^6)*ProjectData!$B$63*ProjectData!$B$64),0)","v":0},0,null,11,{"$f":"IF($H201<=ProjectData!$B$67,-ISPMT(ProjectData!$B$66,$H201,ProjectData!$B$67,(ProjectData!$B$45*10^6)*ProjectData!$B$63*ProjectData!$B$65),0)","v":0},{"$f":"IF($H201<=ProjectData!$B$67,-PPMT(ProjectData!$B$66,$H201,ProjectData!$B$67,(ProjectData!$B$45*10^6)*ProjectData!$B$63*ProjectData!$B$65),0)","v":0},0]
[null,null,12,{"$f":"IF(C202<=ProjectData!B$60,-ISPMT(ProjectData!B$61,C202,ProjectData!B$60,ProjectData!B$59*ProjectData!B$43),0)","v":0.42317600000000005},{"$f":"IF(C202<=ProjectData!B$60,-PPMT(ProjectData!B$61,C202,ProjectData!B$60,ProjectData!B$43*ProjectData!B$59),0)","v":0.52700590393150959},0.95018190393150959,null,12,{"$f":"IF($H202<=ProjectData!$B$67,-ISPMT(ProjectData!$B$66,$H202,ProjectData!$B$67,(ProjectData!$B$45*10^6)*ProjectData!$B$63*ProjectData!$B$64),0)","v":0},{"$f":"IF($H202<=ProjectData!$B$67,-PPMT(ProjectData!$B$66,$H202,ProjectData!$B$67,(ProjectData!$B$45*10^6)*ProjectData!$B$63*ProjectData!$B$64),0)","v":0},0,null,12,{"$f":"IF($H202<=ProjectData!$B$67,-ISPMT(ProjectData!$B$66,$H202,ProjectData!$B$67,(ProjectData!$B$45*10^6)*ProjectData!$B$63*ProjectData!$B$65),0)","v":0},{"$f":"IF($H202<=ProjectData!$B$67,-PPMT(ProjectData!$B$66,$H202,ProjectData!$B$67,(ProjectData!$B$45*10^6)*ProjectData!$B$63*ProjectData!$B$65),0)","v":0},0]
[null,null,13,{"$f":"IF(C203<=ProjectData!B$60,-ISPMT(ProjectData!B$61,C203,ProjectData!B$60,ProjectData!B$59*ProjectData!B$43),0)","v":0.37027900000000002},{"$f":"IF(C203<=ProjectData!B$60,-PPMT(ProjectData!B$61,C203,ProjectData!B$60,ProjectData!B$43*ProjectData!B$59),0)","v":0.57970649432466048},0.94998549432466051,null,13,{"$f":"IF($H203<=ProjectData!$B$67,-ISPMT(ProjectData!$B$66,$H203,ProjectData!$B$67,(ProjectData!$B$45*10^6)*ProjectData!$B$63*ProjectData!$B$64),0)","v":0},{"$f":"IF($H203<=ProjectData!$B$67,-PPMT(ProjectData!$B$66,$H203,ProjectData!$B$67,(ProjectData!$B$45*10^6)*ProjectData!$B$63*ProjectData!$B$64),0)","v":0},0,null,13,{"$f":"IF($H203<=ProjectData!$B$67,-ISPMT(ProjectData!$B$66,$H203,ProjectData!$B$67,(ProjectData!$B$45*10^6)*ProjectData!$B$63*ProjectData!$B$65),0)","v":0},{"$f":"IF($H203<=ProjectData!$B$67,-PPMT(ProjectData!$B$66,$H203,ProjectData!$B$67,(ProjectData!$B$45*10^6)*ProjectData!$B$63*ProjectData!$B$65),0)","v":0},0]
[null,null,14,{"$f":"IF(C204<=ProjectData!B$60,-ISPMT(ProjectData!B$61,C204,ProjectData!B$60,ProjectData!B$59*ProjectData!B$43),0)","v":0.317382},{"$f":"IF(C204<=ProjectData!B$60,-PPMT(ProjectData!B$61,C204,ProjectData!B$60,ProjectData!B$43*ProjectData!B$59),0)","v":0.6376771437571267},0.95505914375712675,null,14,{"$f":"IF($H204<=ProjectData!$B$67,-ISPMT(ProjectData!$B$66,$H204,ProjectData!$B$67,(ProjectData!$B$45*10^6)*ProjectData!$B$63*ProjectData!$B$64),0)","v":0},{"$f":"IF($H204<=ProjectData!$B$67,-PPMT(ProjectData!$B$66,$H204,ProjectData!$B$67,(ProjectData!$B$45*10^6)*ProjectData!$B$63*ProjectData!$B$64),0)","v":0},0,null,14,{"$f":"IF($H204<=ProjectData!$B$67,-ISPMT(ProjectData!$B$66,$H204,ProjectData!$B$67,(ProjectData!$B$45*10^6)*ProjectData!$B$63*ProjectData!$B$65),0)","v":0},{"$f":"IF($H204<=ProjectData!$B$67,-PPMT(ProjectData!$B$66,$H204,ProjectData!$B$67,(ProjectData!$B$45*10^6)*ProjectData!$B$63*ProjectData!$B$65),0)","v":0},0]
[null,null,15,{"$f":"IF(C205<=ProjectData!B$60,-ISPMT(ProjectData!B$61,C205,ProjectData!B$60,ProjectData!B$59*ProjectData!B$43),0)","v":0.26448499999999997},{"$f":"IF(C205<=ProjectData!B$60,-PPMT(ProjectData!B$61,C205,ProjectData!B$60,ProjectData!B$43*ProjectData!B$59),0)","v":0.7014448581328393},0.96592985813283927,null,15,{"$f":"IF($H205<=ProjectData!$B$67,-ISPMT(ProjectData!$B$66,$H205,ProjectData!$B$67,(ProjectData!$B$45*10^6)*ProjectData!$B$63*ProjectData!$B$64),0)","v":0},{"$f":"IF($H205<=ProjectData!$B$67,-PPMT(ProjectData!$B$66,$H205,ProjectData!$B$67,(ProjectData!$B$45*10^6)*ProjectData!$B$63*ProjectData!$B$64),0)","v":0},0,null,15,{"$f":"IF($H205<=ProjectData!$B$67,-ISPMT(ProjectData!$B$66,$H205,ProjectData!$B$67,(ProjectData!$B$45*10^6)*ProjectData!$B$63*ProjectData!$B$65),0)","v":0},{"$f":"IF($H205<=ProjectData!$B$67,-PPMT(ProjectData!$B$66,$H205,ProjectData!$B$67,(ProjectData!$B$45*10^6)*ProjectData!$B$63*ProjectData!$B$65),0)","v":0},0]
[null,null,16,{"$f":"IF(C206<=ProjectData!B$60,-ISPMT(ProjectData!B$61,C206,ProjectData!B$60,ProjectData!B$59*ProjectData!B$43),0)","v":0.21158800000000003},{"$f":"IF(C206<=ProjectData!B$60,-PPMT(ProjectData!B$61,C206,ProjectData!B$60,ProjectData!B$43*ProjectData!B$59),0)","v":0.77158934394612322},0.98317734394612322,null,16,{"$f":"IF($H206<=ProjectData!$B$67,-ISPMT(ProjectData!$B$66,$H206,ProjectData!$B$67,(ProjectData!$B$45*10^6)*ProjectData!$B$63*ProjectData!$B$64),0)","v":0},{"$f":"IF($H206<=ProjectData!$B$67,-PPMT(ProjectData!$B$66,$H206,ProjectData!$B$67,(ProjectData!$B$45*10^6)*ProjectData!$B$63*ProjectData!$B$64),0)","v":0},0,null,16,{"$f":"IF($H206<=ProjectData!$B$67,-ISPMT(ProjectData!$B$66,$H206,ProjectData!$B$67,(ProjectData!$B$45*10^6)*ProjectData!$B$63*ProjectData!$B$65),0)","v":0},{"$f":"IF($H206<=ProjectData!$B$67,-PPMT(ProjectData!$B$66,$H206,ProjectData!$B$67,(ProjectData!$B$45*10^6)*ProjectData!$B$63*ProjectData!$B$65),0)","v":0},0]
[null,null,17,{"$f":"IF(C207<=ProjectData!B$60,-ISPMT(ProjectData!B$61,C207,ProjectData!B$60,ProjectData!B$59*ProjectData!B$43),0)","v":0.158691},{"$f":"IF(C207<=ProjectData!B$60,-PPMT(ProjectData!B$61,C207,ProjectData!B$60,ProjectData!B$43*ProjectData!B$59),0)","v":0.84874827834073552},1.0074392783407355,null,17,{"$f":"IF($H207<=ProjectData!$B$67,-ISPMT(ProjectData!$B$66,$H207,ProjectData!$B$67,(ProjectData!$B$45*10^6)*ProjectData!$B$63*ProjectData!$B$64),0)","v":0},{"$f":"IF($H207<=ProjectData!$B$67,-PPMT(ProjectData!$B$66,$H207,ProjectData!$B$67,(ProjectData!$B$45*10^6)*ProjectData!$B$63*ProjectData!$B$64),0)","v":0},0,null,17,{"$f":"IF($H207<=ProjectData!$B$67,-ISPMT(ProjectData!$B$66,$H207,ProjectData!$B$67,(ProjectData!$B$45*10^6)*ProjectData!$B$63*ProjectData!$B$65),0)","v":0},{"$f":"IF($H207<=ProjectData!$B$67,-PPMT(ProjectData!$B$66,$H207,ProjectData!$B$67,(ProjectData!$B$45*10^6)*ProjectData!$B$63*ProjectData!$B$65),0)","v":0},0]
[null,null,18,{"$f":"IF(C208<=ProjectData!B$60,-ISPMT(ProjectData!B$61,C208,ProjectData!B$60,ProjectData!B$59*ProjectData!B$43),0)","v":0.10579400000000001},{"$f":"IF(C208<=ProjectData!B$60,-PPMT(ProjectData!B$61,C208,ProjectData!B$60,ProjectData!B$43*ProjectData!B$59),0)","v":0.93362310617480893},1.039417106174809,null,18,{"$f":"IF($H208<=ProjectData!$B$67,-ISPMT(ProjectData!$B$66,$H208,ProjectData!$B$67,(ProjectData!$B$45*10^6)*ProjectData!$B$63*ProjectData!$B$64),0)","v":0},{"$f":"IF($H208<=ProjectData!$B$67,-PPMT(ProjectData!$B$66,$H208,ProjectData!$B$67,(ProjectData!$B$45*10^6)*ProjectData!$B$63*ProjectData!$B$64),0)","v":0},0,null,18,{"$f":"IF($H208<=ProjectData!$B$67,-ISPMT(ProjectData!$B$66,$H208,ProjectData!$B$67,(ProjectData!$B$45*10^6)*ProjectData!$B$63*ProjectData!$B$65),0)","v":0},{"$f":"IF($H208<=ProjectData!$B$67,-PPMT(ProjectData!$B$66,$H208,ProjectData!$B$67,(ProjectData!$B$45*10^6)*ProjectData!$B$63*ProjectData!$B$65),0)","v":0},0]
[null,null,19,{"$f":"IF(C209<=ProjectData!B$60,-ISPMT(ProjectData!B$61,C209,ProjectData!B$60,ProjectData!B$59*ProjectData!B$43),0)","v":5.2897000000000007E-2},{"$f":"IF(C209<=ProjectData!B$60,-PPMT(ProjectData!B$61,C209,ProjectData!B$60,ProjectData!B$43*ProjectData!B$59),0)","v":1.0269854167922901},1.07988241679229,null,19,{"$f":"IF($H209<=ProjectData!$B$67,-ISPMT(ProjectData!$B$66,$H209,ProjectData!$B$67,(ProjectData!$B$45*10^6)*ProjectData!$B$63*ProjectData!$B$64),0)","v":0},{"$f":"IF($H209<=ProjectData!$B$67,-PPMT(ProjectData!$B$66,$H209,ProjectData!$B$67,(ProjectData!$B$45*10^6)*ProjectData!$B$63*ProjectData!$B$64),0)","v":0},0,null,19,{"$f":"IF($H209<=ProjectData!$B$67,-ISPMT(ProjectData!$B$66,$H209,ProjectData!$B$67,(ProjectData!$B$45*10^6)*ProjectData!$B$63*ProjectData!$B$65),0)","v":0},{"$f":"IF($H209<=ProjectData!$B$67,-PPMT(ProjectData!$B$66,$H209,ProjectData!$B$67,(ProjectData!$B$45*10^6)*ProjectData!$B$63*ProjectData!$B$65),0)","v":0},0]
[null,null,20,{"$f":"IF(C210<=ProjectData!B$60,-ISPMT(ProjectData!B$61,C210,ProjectData!B$60,ProjectData!B$59*ProjectData!B$43),0)","v":0},{"$f":"IF(C210<=ProjectData!B$60,-PPMT(ProjectData!B$61,C210,ProjectData!B$60,ProjectData!B$43*ProjectData!B$59),0)","v":1.1296839584715188},1.1296839584715188,null,20,{"$f":"IF($H210<=ProjectData!$B$67,-ISPMT(ProjectData!$B$66,$H210,ProjectData!$B$67,(ProjectData!$B$45*10^6)*ProjectData!$B$63*ProjectData!$B$64),0)","v":0},{"$f":"IF($H210<=ProjectData!$B$67,-PPMT(ProjectData!$B$66,$H210,ProjectData!$B$67,(ProjectData!$B$45*10^6)*ProjectData!$B$63*ProjectData!$B$64),0)","v":0},0,null,20,{"$f":"IF($H210<=ProjectData!$B$67,-ISPMT(ProjectData!$B$66,$H210,ProjectData!$B$67,(ProjectData!$B$45*10^6)*ProjectData!$B$63*ProjectData!$B$65),0)","v":0},{"$f":"IF($H210<=ProjectData!$B$67,-PPMT(ProjectData!$B$66,$H210,ProjectData!$B$67,(ProjectData!$B$45*10^6)*ProjectData!$B$63*ProjectData!$B$65),0)","v":0},0]
[null,null,21,{"$f":"IF(C211<=ProjectData!B$60,-ISPMT(ProjectData!B$61,C211,ProjectData!B$60,ProjectData!B$59*ProjectData!B$43),0)","v":0},{"$f":"IF(C211<=ProjectData!B$60,-PPMT(ProjectData!B$61,C211,ProjectData!B$60,ProjectData!B$43*ProjectData!B$59),0)","v":0},0,null,21,{"$f":"IF($H211<=ProjectData!$B$67,-ISPMT(ProjectData!$B$66,$H211,ProjectData!$B$67,(ProjectData!$B$45*10^6)*ProjectData!$B$63*ProjectData!$B$64),0)","v":0},{"$f":"IF($H211<=ProjectData!$B$67,-PPMT(ProjectData!$B$66,$H211,ProjectData!$B$67,(ProjectData!$B$45*10^6)*ProjectData!$B$63*ProjectData!$B$64),0)","v":0},0,null,21,{"$f":"IF($H211<=ProjectData!$B$67,-ISPMT(ProjectData!$B$66,$H211,ProjectData!$B$67,(ProjectData!$B$45*10^6)*ProjectData!$B$63*ProjectData!$B$65),0)","v":0},{"$f":"IF($H211<=ProjectData!$B$67,-PPMT(ProjectData!$B$66,$H211,ProjectData!$B$67,(ProjectData!$B$45*10^6)*ProjectData!$B$63*ProjectData!$B$65),0)","v":0},0]
[null,null,22,{"$f":"IF(C212<=ProjectData!B$60,-ISPMT(ProjectData!B$61,C212,ProjectData!B$60,ProjectData!B$59*ProjectData!B$43),0)","v":0},{"$f":"IF(C212<=ProjectData!B$60,-PPMT(ProjectData!B$61,C212,ProjectData!B$60,ProjectData!B$43*ProjectData!B$59),0)","v":0},0,null,22,{"$f":"IF($H212<=ProjectData!$B$67,-ISPMT(ProjectData!$B$66,$H212,ProjectData!$B$67,(ProjectData!$B$45*10^6)*ProjectData!$B$63*ProjectData!$B$64),0)","v":0},{"$f":"IF($H212<=ProjectData!$B$67,-PPMT(ProjectData!$B$66,$H212,ProjectData!$B$67,(ProjectData!$B$45*10^6)*ProjectData!$B$63*ProjectData!$B$64),0)","v":0},0,null,22,{"$f":"IF($H212<=ProjectData!$B$67,-ISPMT(ProjectData!$B$66,$H212,ProjectData!$B$67,(ProjectData!$B$45*10^6)*ProjectData!$B$63*ProjectData!$B$65),0)","v":0},{"$f":"IF($H212<=ProjectData!$B$67,-PPMT(ProjectData!$B$66,$H212,ProjectData!$B$67,(ProjectData!$B$45*10^6)*ProjectData!$B$63*ProjectData!$B$65),0)","v":0},0]
[null,null,23,{"$f":"IF(C213<=ProjectData!B$60,-ISPMT(ProjectData!B$61,C213,ProjectData!B$60,ProjectData!B$59*ProjectData!B$43),0)","v":0},{"$f":"IF(C213<=ProjectData!B$60,-PPMT(ProjectData!B$61,C213,ProjectData!B$60,ProjectData!B$43*ProjectData!B$59),0)","v":0},0,null,23,{"$f":"IF($H213<=ProjectData!$B$67,-ISPMT(ProjectData!$B$66,$H213,ProjectData!$B$67,(ProjectData!$B$45*10^6)*ProjectData!$B$63*ProjectData!$B$64),0)","v":0},{"$f":"IF($H213<=ProjectData!$B$67,-PPMT(ProjectData!$B$66,$H213,ProjectData!$B$67,(ProjectData!$B$45*10^6)*ProjectData!$B$63*ProjectData!$B$64),0)","v":0},0,null,23,{"$f":"IF($H213<=ProjectData!$B$67,-ISPMT(ProjectData!$B$66,$H213,ProjectData!$B$67,(ProjectData!$B$45*10^6)*ProjectData!$B$63*ProjectData!$B$65),0)","v":0},{"$f":"IF($H213<=ProjectData!$B$67,-PPMT(ProjectData!$B$66,$H213,ProjectData!$B$67,(ProjectData!$B$45*10^6)*ProjectData!$B$63*ProjectData!$B$65),0)","v":0},0]
[null,null,24,{"$f":"IF(C214<=ProjectData!B$60,-ISPMT(ProjectData!B$61,C214,ProjectData!B$60,ProjectData!B$59*ProjectData!B$43),0)","v":0},{"$f":"IF(C214<=ProjectData!B$60,-PPMT(ProjectData!B$61,C214,ProjectData!B$60,ProjectData!B$43*ProjectData!B$59),0)","v":0},0,null,24,{"$f":"IF($H214<=ProjectData!$B$67,-ISPMT(ProjectData!$B$66,$H214,ProjectData!$B$67,(ProjectData!$B$45*10^6)*ProjectData!$B$63*ProjectData!$B$64),0)","v":0},{"$f":"IF($H214<=ProjectData!$B$67,-PPMT(ProjectData!$B$66,$H214,ProjectData!$B$67,(ProjectData!$B$45*10^6)*ProjectData!$B$63*ProjectData!$B$64),0)","v":0},0,null,24,{"$f":"IF($H214<=ProjectData!$B$67,-ISPMT(ProjectData!$B$66,$H214,ProjectData!$B$67,(ProjectData!$B$45*10^6)*ProjectData!$B$63*ProjectData!$B$65),0)","v":0},{"$f":"IF($H214<=ProjectData!$B$67,-PPMT(ProjectData!$B$66,$H214,ProjectData!$B$67,(ProjectData!$B$45*10^6)*ProjectData!$B$63*ProjectData!$B$65),0)","v":0},0]
[null,null,25,{"$f":"IF(C215<=ProjectData!B$60,-ISPMT(ProjectData!B$61,C215,ProjectData!B$60,ProjectData!B$59*ProjectData!B$43),0)","v":0},{"$f":"IF(C215<=ProjectData!B$60,-PPMT(ProjectData!B$61,C215,ProjectData!B$60,ProjectData!B$43*ProjectData!B$59),0)","v":0},0,null,25,{"$f":"IF($H215<=ProjectData!$B$67,-ISPMT(ProjectData!$B$66,$H215,ProjectData!$B$67,(ProjectData!$B$45*10^6)*ProjectData!$B$63*ProjectData!$B$64),0)","v":0},{"$f":"IF($H215<=ProjectData!$B$67,-PPMT(ProjectData!$B$66,$H215,ProjectData!$B$67,(ProjectData!$B$45*10^6)*ProjectData!$B$63*ProjectData!$B$64),0)","v":0},0,null,25,{"$f":"IF($H215<=ProjectData!$B$67,-ISPMT(ProjectData!$B$66,$H215,ProjectData!$B$67,(ProjectData!$B$45*10^6)*ProjectData!$B$63*ProjectData!$B$65),0)","v":0},{"$f":"IF($H215<=ProjectData!$B$67,-PPMT(ProjectData!$B$66,$H215,ProjectData!$B$67,(ProjectData!$B$45*10^6)*ProjectData!$B$63*ProjectData!$B$65),0)","v":0},0]
[null,null,26,{"$f":"IF(C216<=ProjectData!B$60,-ISPMT(ProjectData!B$61,C216,ProjectData!B$60,ProjectData!B$59*ProjectData!B$43),0)","v":0},{"$f":"IF(C216<=ProjectData!B$60,-PPMT(ProjectData!B$61,C216,ProjectData!B$60,ProjectData!B$43*ProjectData!B$59),0)","v":0},0,null,26,{"$f":"IF($H216<=ProjectData!$B$67,-ISPMT(ProjectData!$B$66,$H216,ProjectData!$B$67,(ProjectData!$B$45*10^6)*ProjectData!$B$63*ProjectData!$B$64),0)","v":0},{"$f":"IF($H216<=ProjectData!$B$67,-PPMT(ProjectData!$B$66,$H216,ProjectData!$B$67,(ProjectData!$B$45*10^6)*ProjectData!$B$63*ProjectData!$B$64),0)","v":0},0,null,26,{"$f":"IF($H216<=ProjectData!$B$67,-ISPMT(ProjectData!$B$66,$H216,ProjectData!$B$67,(ProjectData!$B$45*10^6)*ProjectData!$B$63*ProjectData!$B$65),0)","v":0},{"$f":"IF($H216<=ProjectData!$B$67,-PPMT(ProjectData!$B$66,$H216,ProjectData!$B$67,(ProjectData!$B$45*10^6)*ProjectData!$B$63*ProjectData!$B$65),0)","v":0},0]
[null,null,27,{"$f":"IF(C217<=ProjectData!B$60,-ISPMT(ProjectData!B$61,C217,ProjectData!B$60,ProjectData!B$59*ProjectData!B$43),0)","v":0},{"$f":"IF(C217<=ProjectData!B$60,-PPMT(ProjectData!B$61,C217,ProjectData!B$60,ProjectData!B$43*ProjectData!B$59),0)","v":0},0,null,27,{"$f":"IF($H217<=ProjectData!$B$67,-ISPMT(ProjectData!$B$66,$H217,ProjectData!$B$67,(ProjectData!$B$45*10^6)*ProjectData!$B$63*ProjectData!$B$64),0)","v":0},{"$f":"IF($H217<=ProjectData!$B$67,-PPMT(ProjectData!$B$66,$H217,ProjectData!$B$67,(ProjectData!$B$45*10^6)*ProjectData!$B$63*ProjectData!$B$64),0)","v":0},0,null,27,{"$f":"IF($H217<=ProjectData!$B$67,-ISPMT(ProjectData!$B$66,$H217,ProjectData!$B$67,(ProjectData!$B$45*10^6)*ProjectData!$B$63*ProjectData!$B$65),0)","v":0},{"$f":"IF($H217<=ProjectData!$B$67,-PPMT(ProjectData!$B$66,$H217,ProjectData!$B$67,(ProjectData!$B$45*10^6)*ProjectData!$B$63*ProjectData!$B$65),0)","v":0},0]
[null,null,28,{"$f":"IF(C218<=ProjectData!B$60,-ISPMT(ProjectData!B$61,C218,ProjectData!B$60,ProjectData!B$59*ProjectData!B$43),0)","v":0},{"$f":"IF(C218<=ProjectData!B$60,-PPMT(ProjectData!B$61,C218,ProjectData!B$60,ProjectData!B$43*ProjectData!B$59),0)","v":0},0,null,28,{"$f":"IF($H218<=ProjectData!$B$67,-ISPMT(ProjectData!$B$66,$H218,ProjectData!$B$67,(ProjectData!$B$45*10^6)*ProjectData!$B$63*ProjectData!$B$64),0)","v":0},{"$f":"IF($H218<=ProjectData!$B$67,-PPMT(ProjectData!$B$66,$H218,ProjectData!$B$67,(ProjectData!$B$45*10^6)*ProjectData!$B$63*ProjectData!$B$64),0)","v":0},0,null,28,{"$f":"IF($H218<=ProjectData!$B$67,-ISPMT(ProjectData!$B$66,$H218,ProjectData!$B$67,(ProjectData!$B$45*10^6)*ProjectData!$B$63*ProjectData!$B$65),0)","v":0},{"$f":"IF($H218<=ProjectData!$B$67,-PPMT(ProjectData!$B$66,$H218,ProjectData!$B$67,(ProjectData!$B$45*10^6)*ProjectData!$B$63*ProjectData!$B$65),0)","v":0},0]
[null,null,29,{"$f":"IF(C219<=ProjectData!B$60,-ISPMT(ProjectData!B$61,C219,ProjectData!B$60,ProjectData!B$59*ProjectData!B$43),0)","v":0},{"$f":"IF(C219<=ProjectData!B$60,-PPMT(ProjectData!B$61,C219,ProjectData!B$60,ProjectData!B$43*ProjectData!B$59),0)","v":0},0,null,29,{"$f":"IF($H219<=ProjectData!$B$67,-ISPMT(ProjectData!$B$66,$H219,ProjectData!$B$67,(ProjectData!$B$45*10^6)*ProjectData!$B$63*ProjectData!$B$64),0)","v":0},{"$f":"IF($H219<=ProjectData!$B$67,-PPMT(ProjectData!$B$66,$H219,ProjectData!$B$67,(ProjectData!$B$45*10^6)*ProjectData!$B$63*ProjectData!$B$64),0)","v":0},0,null,29,{"$f":"IF($H219<=ProjectData!$B$67,-ISPMT(ProjectData!$B$66,$H219,ProjectData!$B$67,(ProjectData!$B$45*10^6)*ProjectData!$B$63*ProjectData!$B$65),0)","v":0},{"$f":"IF($H219<=ProjectData!$B$67,-PPMT(ProjectData!$B$66,$H219,ProjectData!$B$67,(ProjectData!$B$45*10^6)*ProjectData!$B$63*ProjectData!$B$65),0)","v":0},0]
[null,null,30,{"$f":"IF(C220<=ProjectData!B$60,-ISPMT(ProjectData!B$61,C220,ProjectData!B$60,ProjectData!B$59*ProjectData!B$43),0)","v":0},{"$f":"IF(C220<=ProjectData!B$60,-PPMT(ProjectData!B$61,C220,ProjectData!B$60,ProjectData!B$43*ProjectData!B$59),0)","v":0},0,null,30,{"$f":"IF($H220<=ProjectData!$B$67,-ISPMT(ProjectData!$B$66,$H220,ProjectData!$B$67,(ProjectData!$B$45*10^6)*ProjectData!$B$63*ProjectData!$B$64),0)","v":0},{"$f":"IF($H220<=ProjectData!$B$67,-PPMT(ProjectData!$B$66,$H220,ProjectData!$B$67,(ProjectData!$B$45*10^6)*ProjectData!$B$63*ProjectData!$B$64),0)","v":0},0,null,30,{"$f":"IF($H220<=ProjectData!$B$67,-ISPMT(ProjectData!$B$66,$H220,ProjectData!$B$67,(ProjectData!$B$45*10^6)*ProjectData!$B$63*ProjectData!$B$65),0)","v":0},{"$f":"IF($H220<=ProjectData!$B$67,-PPMT(ProjectData!$B$66,$H220,ProjectData!$B$67,(ProjectData!$B$45*10^6)*ProjectData!$B$63*ProjectData!$B$65),0)","v":0},0]
[null,null,"Total",{"$f":"SUM(D191:D220)","v":10.05043},{"$f":"SUM(E191:E220)","v":10.579399999999998},20.629829999999998,null,"Total",{"$f":"SUM(I191:I220)","v":0},{"$f":"SUM(J191:J220)","v":0},0,null,"Total",{"$f":"SUM(N191:N220)","v":24316155.341753215},{"$f":"SUM(O191:O220)","v":45029917.299542993},69346072.641296208]
[null,null,"AvgAnn",{"$f":"D221/ProjectData!B60","v":0.50252150000000007},{"$f":"E221/ProjectData!B60","v":0.52896999999999994},1.0314915,null,"AvgAnn",{"$f":"I221/ProjectData!$B$67","v":0},{"$f":"J221/ProjectData!$B$67","v":0},0,null,"AvgAnn",{"$f":"N221/ProjectData!$B$67","v":2431615.5341753215},{"$f":"O221/ProjectData!$B$67","v":4502991.7299542995},6934607.264129621]

{"sheet":"Deflators","index":8,"n_rows":55,"n_cols":39,"rows_kept":55,"cut":false,"hidden":false,"merged":[]}
[]
[null,null,{"$f":"CONCATENATE(\"Conversion to Year \",E4,\" dollars and back for consistency with multiplier data.\")","v":"Conversion to Year 2014 dollars and back for consistency with multiplier data."}]
[]
[null,null,"  Year of Multiplier Data",null,{"$f":"IF(ProjectData!B12=\"MYCOUNTY\",'User Add-in Location'!D3,IF(ProjectData!B12=\"MYREGION\",'User Add-in Location'!D4,Multipliers!D2))","v":2014},{"$f":"IF(E4=0,\"ERROR\",\"\")","v":""},"Region of Analysis",null,{"$f":"ProjectData!B12","v":"California"}]
["Warning",null,"  Year of Construction $s",null,{"$f":"+ProjectData!B21","v":2009}]
[]
["This Worksheet contains Data and Formulas that are an integral part of the JEDI model.  ",null,null,"Deflator",null,{"$f":"HLOOKUP($E$5,$D$11:$AM$39,$D$51)","v":1.0843}]
[null,null,null,"Inflator",null,{"$f":"HLOOKUP($E$5,$D$11:$AM$39,$D$52)","v":0.92225398874850129}]
["Although the data and formulas are available for review they must not be changed."]
[]
["Any changes to the data or formulas will impact the analysis and may invalidate the model results.",null,null,2005,2006,2007,2008,2009,2010,2011,2012,2013,2014,2015,2016,2017,2018,2019,2020,2021,2022,2023,2024,2025,2026,2027,2028,2029,2030,2031,2032,2033,2034,2035,2036,2037,2038,2039,2040]
[null,null,"2007$",0.94289549772821146,0.97356464270962406,1,1.0207558859975217,1.0326311441553078,1.0417182982238744,1.0628872366790583,1.082300702189178,1.1008880627839737,1.1196819496076003,1.1348616274266832,1.1528294093349856,1.1734820322180917,1.1961999173895086,1.2201569599339115,1.2446303180503924,1.2666461495080106,1.2890514113271916,1.3118529920057327,1.3350579018896658,1.3586732753285877,1.3827063728691165,1.4071645834871456,1.4320554268595855,1.4573865556762882,1.4831657579928661,1.5094009596251305,1.5361002265858834,1.5632717675648127,1.5909239364522545,1.6190652349075965,1.6477043149731132,1.6768499817340363,1.706511196025678,1.73669707718844,1.767416905871555]
[null,null,null,1.0605629175336766,1.0271531607976241,1,0.97966616084977243,0.96839999999999993,0.95995241871530534,0.94083357621684638,0.92395763762999716,0.90835756495638298,0.89311076270404866,0.88116469517743401,0.86743102830526686,0.85216473072861676,0.83598066298342533,0.81956668923493581,0.80345142288227001,0.78948647212042522,0.77576424897623919,0.76228053455217493,0.74903118328020191,0.73601212164724106,0.7232193469427638,0.71064892602815777,0.69829699412748425,0.68615975363925208,0.67423347296884528,0.66251448538124447,0.65099918787368916,0.63968404006793422,0.62856556312176093,0.61764033865940682,0.60690500772058587,0.59635626972777644,0.5859908814714585,0.57580565611298895,0.56579746220480809]
[null,null,"2008$",0.92372281234193221,0.95376833586241772,0.97966616084977243,1,1.0116337885685383,1.0205361659079413,1.0412746585735964,1.0602933737986848,1.0785027819929185,1.096914516944866,1.1117855336368234,1.1293879615579161,1.1496206373292868,1.1718765806777947,1.1953464845725847,1.219322205361659,1.2408903704436596,1.2628400472728905,1.2851779842775433,1.307911049256401,1.3310462314903435,1.3545906438912014,1.3785515251886211,1.4029362421556124,1.4277522918734626,1.4530073040367142,1.4787090432989145,1.5048654116598583,1.5314844508950582,1.5585743450281879,1.5861434228472604,1.6142001604653144,1.6427531839263947,1.6718112718576297,1.7013833581682203,1.7314785347961703]
[null,null,null,1.0825758405432044,1.0484726347051336,1.0207558859975217,1,0.98849999999999993,0.97987708168120546,0.96036141066744385,0.94313519702318482,0.92721133101960418,0.91164806787789354,0.8994540491355778,0.88543532783948398,0.86985216473072868,0.85333218232044195,0.83657752200406232,0.82012776902016093,0.80587296333234237,0.79186592328894312,0.77810234242546983,0.76457798912895447,0.75128870533694514,0.73823040525910977,0.72539907412105931,0.71279076693000631,0.70040160726187572,0.68822778606949953,0.67626556051152409,0.66451125280167445,0.65296124907801811,0.64161199829188409,0.63046001111609196,0.61950185887215925,0.60873417247615336,0.5981536414028672,0.58775701266799818,0.57754108982801799]
[null,null,"2009$",0.91310000000000002,0.94279999999999997,0.96840000000000004,0.98850000000000005,1,1.0087999999999999,1.0293000000000001,1.0481,1.0661,1.0843,1.099,1.1164000000000001,1.1364000000000001,1.1584000000000001,1.1816,1.2053,1.2266201311835576,1.2483173867292525,1.2703984374583517,1.2928700721899526,1.3157391998282046,1.3390128514864525,1.3626981826489519,1.3868024753708228,1.4113331405169178,1.436297720040292,1.4617038893009771,1.4875594594257702,1.5138723797097653,1.540650740060364,1.5679027734845172,1.5956368586199636,1.6238615223112416,1.6525854422312674,1.6818174495492861,1.7115665316460147]
[null,null,null,1.0951702989814915,1.0606703436571914,1.0326311441553078,1.0116337885685383,1,0.99127676447264079,0.97153405226853196,0.95410743249689911,0.93799831160303904,0.92225398874850129,0.90991810737033674,0.8957362952346829,0.87997184090109115,0.86325966850828717,0.84631008801624918,0.82966896208412844,0.81524831900085204,0.8010783240151168,0.78715462056193186,0.77347292779863863,0.76002903928876597,0.74681882170876046,0.73383821357719714,0.72108322400607616,0.70854993147382472,0.69623448261962517,0.68413309105869913,0.67224203621818346,0.6605576621932403,0.64907637662304907,0.63779464958633469,0.62670901251609423,0.61581605713318477,0.60511243439844919,0.59459485348305319,0.5842600807567202]
["To view the data and formulas simply scroll over to the adjacent columns to the right.",null,"2010$",0.90513481363996839,0.93457573354480572,0.95995241871530546,0.97987708168120546,0.99127676447264079,1,1.0203211736716893,1.0389571768437749,1.0568001586042826,1.0748413957176846,1.0894131641554323,1.1066613798572562,1.1264869151467092,1.1482950039651072,1.1712926249008724,1.1947858842188741,1.2159200348766432,1.2374280201519157,1.2593164526748135,1.2815920620439658,1.3042616968955243,1.3273323270087756,1.350811045449001,1.3747050707482387,1.3990217491246215,1.4237685567409719,1.4489531020033479,1.4745831279002481,1.5006665143831934,1.5272112807894174,1.5542255883074123,1.5817177424860864,1.6096961957883047,1.638169550189599,1.6671465598228452,1.6966361336697213]
[null,null,null,1.1048077976125286,1.0700042426813745,1.0417182982238742,1.0205361659079413,1.0087999999999999,1,0.98008355192849494,0.96250357790287178,0.94625269674514567,0.93036982384948796,0.91792538671519552,0.90361877463274809,0.88771559310102055,0.87085635359116009,0.8537576167907921,0.83697004895046867,0.82242250420805951,0.80812781326644978,0.79408158122287675,0.78027948956326665,0.7667172948345069,0.75339082733979745,0.74029598985667633,0.72742875637732951,0.71478517087079418,0.70236134606667766,0.6901534622600155,0.67815776613690337,0.66637056962054075,0.65478824873733177,0.64340724250269432,0.63222405182623564,0.62123523843595674,0.61043742382115551,0.59982728819370401,0.5894015694673792]
[null,null,"2011$",0.88710774312639651,0.91596230447877192,0.94083357621684638,0.96036141066744385,0.97153405226853196,0.98008355192849494,1,1.0182648401826484,1.0357524531234819,1.0534343728747693,1.0677159234431166,1.0846206159525891,1.1040512969979597,1.1254250461478674,1.1479646361604974,1.1709899931992616,1.1917032266429199,1.2127828492463346,1.2342353419395236,1.256067300291414,1.2782854365376513,1.3008965816442752,1.3239076874079005,1.3473258285930467,1.3711582051072748,1.3954121442147986,1.4200951027892521,1.4452146696063055,1.4707785676768341,1.4967946566213581,1.5232709350864833,1.5502155432040841,1.5776367650939878,1.6055430314109271,1.6339429219365453,1.6628451682172491]
[null,null,null,1.1272587887416494,1.0917479847263472,1.0628872366790583,1.0412746585735964,1.0293000000000001,1.0203211736716893,1,0.98206278026905824,0.96548166213300823,0.94927603061883248,0.93657870791628761,0.9219813686850592,0.90575501583949325,0.8885531767955801,0.87110697359512534,0.85397826267319343,0.83913509474757708,0.82454991890875995,0.81021825094439659,0.79613568458313888,0.7822978901399269,0.76870061318482719,0.75533967323500895,0.74221096246945417,0.72931044446600779,0.71663415296038013,0.70417819062671894,0.69193872787937616,0.67991200169550225,0.66809431445810441,0.65648203281921436,0.64507158658281571,0.63385946760718714,0.62284222872632378,0.61201648269010667,0.60137890112289216]
[null,null,"2012$",0.87119549661291862,0.89953248735807645,0.92395763762999716,0.94313519702318482,0.95410743249689911,0.96250357790287178,0.98206278026905836,1,1.0171739337849441,1.0345386890563877,1.0485640683140922,1.0651655376395381,1.0842476862894763,1.1052380498044081,1.1273733422383361,1.1499856883885125,1.1703273840125537,1.1910288967934857,1.2120965914114603,1.2335369451292362,1.2553565497836128,1.2775621138120909,1.3001604643153821,1.3231585491564002,1.3465634390963821,1.3703823299687934,1.3946225448916871,1.4192915365191969,1.4443968893328551,1.4699463219734417,1.4959476896140802,1.5224089863753114,1.549338347782885,1.5767440532690273,1.6046345287179529,1.6330183490564021]
[null,null,null,1.1478479903625014,1.1116885871871023,1.082300702189178,1.0602933737986848,1.0481,1.0389571768437749,1.0182648401826484,1,0.98311603039114537,0.96661440560730427,0.95368516833484984,0.93882121103547123,0.9222984864484336,0.90478245856353579,0.8870176032498307,0.86957603916037507,0.85446176314479316,0.83961019140024407,0.82501675781096095,0.81067697562575336,0.79658643607855562,0.7827408070329519,0.76913583165026034,0.75576732708076833,0.74263118317771559,0.72972336123362902,0.71703989273862245,0.70457687816027803,0.6923304857447351,0.68029695033861759,0.6684725722314373,0.65685371601811826,0.6454368094812909,0.63421834249301456,0.62319486593558793,0.61236299064111832]
[null,null,"2013$",0.85648625832473502,0.88434480817934524,0.90835756495638309,0.92721133101960418,0.93799831160303904,0.94625269674514578,0.96548166213300823,0.98311603039114526,1,1.0170715692711754,1.03086014445174,1.0471813150736329,1.0659412813056937,1.0865772441609605,1.108338804990151,1.1305693649751429,1.1505676120284751,1.1709196010967566,1.1916315893990728,1.2127099448362746,1.2341611479487895,1.2559917939090635,1.2782085945492467,1.3008183804247471,1.3238281029142835,1.3472448363570884,1.3710757802279119,1.3953282613505018,1.4200097361502346,1.445127792946594,1.4706901542861994,1.496704679317103,1.5231793662050852,1.5501223545926903,1.5775419281017595,1.605446516880231]
[null,null,null,1.1675610557441682,1.1307806533729317,1.1008880627839734,1.0785027819929185,1.0661,1.0568001586042823,1.0357524531234819,1.0171739337849441,1,0.98321497740477726,0.97006369426751593,0.95494446434969549,0.93813797958465328,0.92032113259668513,0.90225118483412325,0.88451008047788937,0.86913623288680864,0.85402960123251614,0.83918554098107578,0.82459948832612884,0.8102669587857535,0.79618354582370954,0.7823449194946499,0.76874682511287784,0.75538508194424459,0.74225558192078245,0.72935428837767924,0.71667723481220547,0.70422052366421362,0.69198032511783258,0.67995287592399145,0.66813447824340799,0.65652149850968844,0.64511036631218677,0.63389757329828311,0.62287967209473949]
[null,null,"2014$",0.84211011712625661,0.86950106059208698,0.89311076270404866,0.91164806787789354,0.92225398874850129,0.93036982384948808,0.94927603061883248,0.96661440560730427,0.98321497740477726,1,1.013557133634603,1.0296043530388268,1.048049432813797,1.068339020566264,1.0897353131052292,1.1115927326385686,1.1312553086632458,1.1512656891351583,1.1716300262458281,1.1923545810107463,1.2134457251943229,1.2349099432688853,1.2567538344083296,1.2789841145170364,1.3016076182946763,1.3246313013375373,1.3480622422770234,1.3719076449559804,1.3961748406435162,1.4208712902890004,1.4460045868159332,1.4715824574563892,1.4976127661267551,1.5241035158454914,1.5510628511936595,1.578499060818974]
[null,null,null,1.1874931551856314,1.1500848536274926,1.1196819496076003,1.096914516944866,1.0843,1.0748413957176846,1.0534343728747693,1.0345386890563877,1.0170715692711754,1,0.98662420382165605,0.97124686492296675,0.95415346708905302,0.9360324585635359,0.91765402843601895,0.89961005558782048,0.88397375229262409,0.8686092267295914,0.85351175507530297,0.83867669561206415,0.82409948730080906,0.80977564837880911,0.79570077498175495,0.7818705397897886,0.76828069069706839,0.75492704950445977,0.74180551063494771,0.72891203987137665,0.71624267311613088,0.70379351517237243,0.69156073854646305,0.67954058227120129,0.66772935074951267,0.65612341261823892,0.64471919963167501,0.63351320556451218]
[null,null,"2015$",0.8308462238398544,0.85787079162875346,0.88116469517743412,0.8994540491355778,0.90991810737033674,0.91792538671519552,0.93657870791628761,0.95368516833484995,0.97006369426751604,0.98662420382165616,1,1.015832575068244,1.0340309372156506,1.0540491355777981,1.0751592356687898,1.0967242948134668,1.1161238682288968,1.135866593930166,1.1559585418183365,1.1764058891628322,1.1972149225006412,1.2183920395691108,1.2399437512729319,1.2618766836859172,1.2841975800881873,1.3069133030393922,1.3300308364886051,1.3535572879215378,1.3774998905457372,1.4018660055144347,1.4266631241897334,1.4518988704458267,1.4775810030129586,1.5037174178628456,1.530316150636293,1.5573853791137531]
[null,null,null,1.2035921585806593,1.1656767076792531,1.1348616274266832,1.1117855336368234,1.099,1.0894131641554323,1.0677159234431166,1.048564068314092,1.0308601444517398,1.0135571336346028,1,0.9844141884629164,0.96708905315029914,0.94872237569060758,0.93009478672985779,0.91180618933045721,0.89595790258193653,0.88038507809261346,0.86508292799756314,0.85004674765070398,0.83527191417835378,0.82075388505792768,0.80648819672133953,0.79247046318267766,0.77869637468973341,0.76516169639896803,0.75186226707351034,0.73879399780378363,0.72595287075037118,0.71333493790873093,0.70093631989538197,0.68875320475518753,0.67678184678937015,0.6650185654038957,0.65345974397787554,0.64210182875163546]
[null,null,"2016$",0.81789681117878898,0.84450017914725894,0.86743102830526697,0.88543532783948409,0.8957362952346829,0.90361877463274798,0.9219813686850592,0.93882121103547111,0.95494446434969549,0.97124686492296664,0.9844141884629164,1,1.0179147259046937,1.0376209243998566,1.0584020064493012,1.0796309566463633,1.0987281719666406,1.1181631912659016,1.137941989840874,1.1580706486832253,1.1785553563491624,1.199402410862104,1.2206182216490078,1.2422093115109487,1.2641823186285543,1.2865439986029132,1.3093012265325845,1.3324609991273473,1.3560304368593386,1.3800167861522432,1.4044274216092061,1.4292698482801542,1.4545517039692244,1.480280761583006,1.5064649315203213,1.5331122641042774]
[null,null,null,1.2226481217829372,1.1841323716588885,1.1528294093349856,1.1293879615579161,1.1164000000000001,1.1066613798572562,1.0846206159525891,1.0651655376395384,1.0471813150736329,1.029604353038827,1.015832575068244,1,0.98240056318197821,0.96374309392265201,0.94482058226134069,0.92624242927072098,0.91014322333255127,0.89432384093047634,0.87877941839534068,0.86350517659440018,0.84849641946197807,0.83374853255566006,0.81925698163758265,0.80501731128038323,0.79102514349737785,0.77727617639654945,0.76376618285793152,0.75049100923397982,0.73744657407253333,0.72462886686197181,0.71203394679818388,0.69965794157296735,0.68749704618348728,0.67554752176242849,0.66380569442848036,0.65226795415680217]
[null,null,"2017$",0.80350228792678635,0.82963745160154867,0.85216473072861665,0.86985216473072857,0.87997184090109115,0.88771559310102066,0.90575501583949314,0.9222984864484336,0.93813797958465328,0.95415346708905313,0.96708905315029914,0.98240056318197821,1,1.019359380499824,1.0397747272087292,1.0606300598380851,1.0793911749239329,1.0984841488289794,1.1179148516880952,1.137689257470919,1.1578134458185536,1.1782936039127527,1.1991360283781693,1.2203471272182529,1.2419334217853903,1.2639015487858956,1.2862582623204653,1.3090104359607266,1.3321650648625174,1.3557292679165465,1.3797102899370968,1.4041155038894431,1.4289524131566711,1.4542286538465916,1.4799519971394628,1.5061303516772386]
[null,null,null,1.2445515277625672,1.2053457785320323,1.1734820322180917,1.1496206373292868,1.1364000000000001,1.1264869151467092,1.1040512969979597,1.0842476862894763,1.0659412813056937,1.048049432813797,1.0340309372156506,1.0179147259046937,1,0.98100828729281764,0.96174678402166569,0.94283580851240356,0.92644818971256848,0.91034540741077896,0.89452251080657963,0.87897463515037322,0.86369700024775387,0.84868490898983562,0.83393374590912706,0.81943897576050517,0.80519614212685453,0.79120086604894224,0.77744884467910591,0.76393584995834385,0.75065772731639857,0.73761039439443321,0.72478983978991096,0.71219212182328973,0.6998133673261514,0.68764977045039799,0.6756975914981419,0.66395315577193703]
[null,null,"2018$",0.78824240331491713,0.81388121546961312,0.83598066298342533,0.85333218232044195,0.86325966850828717,0.87085635359116009,0.8885531767955801,0.9047824585635359,0.92032113259668502,0.9360324585635359,0.94872237569060769,0.96374309392265189,0.98100828729281764,1,1.0200276243093922,1.0404868784530386,1.0588916878311097,1.0776220534610257,1.0966837339937425,1.1160825899429836,1.1358245854870548,1.1559157903025312,1.1763623814303794,1.1971706451750885,1.2183469790373942,1.2398978936811909,1.2618300149352353,1.2841500858302568,1.3068649686721034,1.3299816471515566,1.353507228491468,1.3774489456318741,1.4018141594537645,1.4266103610421845,1.4518451739893692,1.4775263567386168]
[null,null,null,1.2686452743401599,1.2286805260924907,1.1961999173895086,1.1718765806777947,1.1584000000000001,1.1482950039651072,1.1254250461478674,1.1052380498044081,1.0865772441609607,1.068339020566264,1.0540491355777981,1.0376209243998566,1.019359380499824,1,0.98036560595802313,0.96108852567825453,0.94438365273058722,0.92796913053911156,0.91183991245894214,0.89599103956194337,0.88041763911210669,0.86511492306742843,0.85007818660782541,0.83530280668863888,0.82078424061927879,0.80651802466657418,0.79249977268239735,0.77872517475514413,0.76518999588464998,0.75189007468014035,0.73882132208081053,0.72597972009864375,0.71336132058308166,0.70096224400716389,0.68877867827476913,0.67680687754858504]
[null,null,"2019$",0.77276574136763709,0.79790115098171965,0.8195666892349357,0.83657752200406232,0.84631008801624918,0.8537576167907921,0.87110697359512534,0.88701760324983081,0.90225118483412325,0.91765402843601895,0.93009478672985779,0.94482058226134058,0.96174678402166558,0.98036560595802313,1,1.0200575490859851,1.0381009911844596,1.0564635974350476,1.0751510134210829,1.0941689845886531,1.113523358013037,1.1332200841963884,1.1532652188972172,1.1736649249922333,1.194425474371122,1.2155532498648374,1.2370547472080033,1.2589365770360272,1.2812054669175397,1.3038682634227856,1.3269319342286026,1.3504035702606323,1.3742903878734267,1.3985997310691154,1.4233390737553195,1.4485160220430044]
[null,null,null,1.2940532252765304,1.2532880780653373,1.2201569599339115,1.1953464845725847,1.1816,1.1712926249008724,1.1479646361604974,1.1273733422383359,1.108338804990151,1.0897353131052292,1.0751592356687898,1.0584020064493014,1.0397747272087292,1.0200276243093922,1,0.98033684559860612,0.96329741373140687,0.94655414765626222,0.93010189965597889,0.91393561148687152,0.89805031282360592,0.88244111973107142,0.86710323316281623,0.85203193748557959,0.83722259902947138,0.82267066466334926,0.808371660394959,0.7943211899954058,0.78051493364753299,0.76694864661779494,0.75361815795121334,0.74051936918901717,0.7276482531085714,0.71500085248520784,0.70257327887557586,0.69036171142214087]
[null,null,"2020$",0.7575707292790177,0.78221189745291619,0.80345142288227001,0.82012776902016093,0.82966896208412844,0.83697004895046867,0.85397826267319343,0.86957603916037496,0.88451008047788937,0.89961005558782048,0.9118061893304571,0.92624242927072098,0.94283580851240356,0.96108852567825442,0.98033684559860612,1,1.0176886511105596,1.0356901905992304,1.0540101530393691,1.07265417090347,1.0916279762948682,1.1109374027100745,1.1305883868322841,1.1505869703566107,1.1709393018476046,1.1916516386296292,1.2127303487106753,1.2341819127402058,1.2560129260016304,1.2782301004400263,1.3008402667257255,1.3238503763544043,1.3472675037843205,1.3710988486113558,1.395351737782532,1.4200336278486803]
[null,null,null,1.3200087613623919,1.2784259652100129,1.2446303180503924,1.219322205361659,1.2053,1.1947858842188741,1.1709899931992616,1.1499856883885127,1.1305693649751429,1.1115927326385686,1.0967242948134668,1.0796309566463633,1.0606300598380851,1.0404868784530386,1.0200575490859851,1,0.9826187988917271,0.96553970393542032,0.94875746416329665,0.93226691987569932,0.91606300105474958,0.90014072580556892,0.8844951988245956,0.86912160989452358,0.85401523240540089,0.83917142190143423,0.82458561465305014,0.81025332625377655,0.79617015024151272,0.7823317567437611,0.76873389114640933,0.75537237278564839,0.74224309366262775,0.729342017180451,0.71666517690312415,0.70420867533607501]
[]
[]
[]
[null,null,"Source:  Deflators and Inflators derived from data contained in the Budget of the United States Government: Table 10.1 - Gross Domestic Product and Deflators Used in the Historical Tables 1940-2021.  "]
[null,null,"https://www.whitehouse.gov/omb/budget/Historicals"]
[null,null,"Updated November 2016.  Deflators for 2016-2040 assume average annual inflation rate derived from 2013-2020 GDP values."]
[]
[]
[]
[]
[null,null,{"$f":"(ROUND(C49,4))*100","v":0}]
[null,null,null,{"$f":"HLOOKUP($E$4,E$51:R$53,3)","v":17},2007,2008,2009,2010,2011,2012,2013,2014,2015,2016,2017,2018,2019,2020]
[null,null,null,{"$f":"HLOOKUP($E$4,E$51:R$53,2)","v":16},2,4,6,8,10,12,14,16,18,20,22,24,26,28]
[null,null,null,null,3,5,7,9,11,13,15,17,19,21,23,25,27,29]
[]
[null,null,{"$f":"C53*100","v":0}]

{"sheet":"Household Exp","index":9,"n_rows":20,"n_cols":57,"rows_kept":20,"cut":false,"hidden":true,"merged":[]}
[null,null,"Personal Consumption Expenditures "]
[null,null,"Year of Data",2014]
[null,null,null,"Alabama","Alaska","Arizona","Arkansas","California","Colorado","Connecticut","Delaware","District of Columbia","Florida","Georgia","Hawaii","Idaho","Illinois","Indiana","Iowa","Kansas","Kentucky","Louisiana","Maine","Maryland","Massachusetts","Michigan","Minnesota","Mississippi","Missouri","Montana",{"$f":"'User Add-in Location'!E10","v":"MyCounty"},{"$f":"'User Add-in Location'!F10","v":"MyRegion"},"Nebraska","Nevada","New Hampshire","New Jersey","New Mexico","New York","North Carolina","North Dakota","Ohio","Oklahoma","Oregon","Pennsylvania","Rhode Island","South Carolina","South Dakota","Tennessee","Texas","United States","Utah","Vermont","Virginia","Washington","West Virginia","Wisconsin","Wyoming"]
[null,null,"Agriculture",4.3843303811985359E-3,1.4119513424010147E-3,4.5642380753062282E-3,8.1786328792903557E-3,3.9792492388490055E-3,7.0195462872580253E-3,7.6086075854367723E-4,5.1514563718655336E-3,4.2922894157143207E-4,3.4583683647851009E-3,4.5081025455065496E-3,4.9429891793557282E-3,9.4917506916313097E-3,2.8667610141038728E-3,2.5450437181696911E-3,9.3934737604823137E-3,8.7900656478127337E-3,3.1759610937596942E-3,1.6396370820067549E-3,4.0676609250438669E-3,2.0831860584223857E-3,6.3727734320123469E-4,2.3812381206889124E-3,5.6398054812691872E-3,6.3861398447143574E-3,4.1043641887382794E-3,6.2438382649901989E-3,{"$f":"'User Add-in Location'!E11","v":0},{"$f":"'User Add-in Location'!F11","v":0},8.8871317877506888E-3,2.5375642195257738E-3,1.3888574975611571E-3,5.5163955170102247E-4,6.9791702369014427E-3,2.8803446526979911E-3,4.6077941083095941E-3,5.6095972719861992E-3,2.0636412707860049E-3,4.9050588826224902E-3,6.3409776607044714E-3,2.9035521794555925E-3,5.1679885725791034E-4,2.462276782699504E-3,9.4962445436134052E-3,2.0966127647710255E-3,3.014855508898549E-3,5.5260114358864042E-3,3.326996211047858E-3,8.7538136649898297E-3,3.7363843893953568E-3,3.8505743532937222E-3,2.7076340157701534E-3,7.5054452682812509E-3,3.9891255794072527E-3]
["Warning",null,"Mining",3.6773337946463026E-6,2.3634816624978557E-5,4.4283297127019233E-6,6.797702789397975E-6,7.6359916951794383E-6,1.2855165380975011E-5,1.4421870222460384E-6,6.185274109112409E-7,4.0821663890116674E-7,3.6201289907853514E-6,1.558401713256141E-6,2.0201369292087284E-6,3.6726986121286635E-6,2.3025902350079342E-6,2.008952670351302E-6,1.2867504950935838E-6,1.1185176603211212E-5,3.426991232403623E-6,2.1146912621011047E-5,1.2332214245915419E-6,1.9918351578770608E-6,1.2748979158907943E-6,2.4440630223929237E-6,1.4453697351436066E-6,6.8153249216265298E-6,1.6836757825805849E-6,1.1670530787507312E-5,{"$f":"'User Add-in Location'!E12","v":0},{"$f":"'User Add-in Location'!F12","v":0},2.0100264979982797E-6,1.1249469601524793E-5,1.717982414294884E-6,1.2543190654021425E-6,2.3480613968216137E-5,1.6327890029108609E-6,1.4217484079774229E-6,1.7772514413667098E-5,4.4978991890939157E-6,2.06275835213656E-5,2.1103497251827175E-6,7.6035986913116547E-6,9.4759943939609369E-7,1.2506144101517982E-6,3.3045540792100384E-6,1.6208048456688673E-6,2.145813723175278E-5,1.1925970050436198E-5,1.0051868482481531E-5,2.1244916594583427E-6,3.0913345668405351E-6,1.6061511540393748E-6,1.3350154124952537E-5,1.1620933271415177E-6,2.7073449336075241E-5]
[null,null,"Construction",0,0,0,0,0,0,0,0,0,0,0,0,0,0,0,0,0,0,0,0,0,0,0,0,0,0,0,{"$f":"'User Add-in Location'!E13","v":0},{"$f":"'User Add-in Location'!F13","v":0},0,0,0,0,0,0,0,0,0,0,0,0,0,0,0,0,0,0,0,0,0,0,0,0,0]
["This Worksheet contains Data and Formulas that are an integral part of the JEDI model.  ",null,"Manufacturing",4.5387699375112708E-2,4.7516154386840946E-2,2.6016019839074693E-2,3.8716140993729095E-2,8.4246952112902174E-2,4.6785312959392457E-2,2.6914433848206319E-2,2.7050818178525653E-2,1.4062697706346782E-3,3.5882941443291544E-2,4.107786659675227E-2,4.7717123505710834E-2,3.4840698576490761E-2,5.3619903155567465E-2,5.4506346594586579E-2,3.4478828789508933E-2,4.3449039277708344E-2,4.175371942135115E-2,5.4442608118617869E-2,3.3381058637137924E-2,2.1717900252005869E-2,3.5008287481424878E-2,5.9737902338166442E-2,5.8561843833059291E-2,3.9646167802461087E-2,3.2299161689997004E-2,4.1316680699936277E-2,{"$f":"'User Add-in Location'!E14","v":0},{"$f":"'User Add-in Location'!F14","v":0},2.7513412540971484E-2,1.636506977312617E-2,1.7462985321525442E-2,3.9476878075801983E-2,3.4499424464728104E-2,3.0294557471942197E-2,5.0989745206259617E-2,3.0932976464933402E-2,6.1055057251266323E-2,4.4021851495473677E-2,3.7839177510743081E-2,5.2782222735749083E-2,1.4264693232087473E-2,3.476185020998087E-2,1.765264397039688E-2,4.0810666863776164E-2,8.8375855808212667E-2,0.14375821218021728,5.7723752495623559E-2,2.2156788222306382E-2,3.0945632266465534E-2,6.5328345450713518E-2,1.9035011726301475E-2,4.8796928866811834E-2,3.7161545013766603E-2]
[null,null,"Fabricated Metals",1.1245767725101089E-6,4.3908459481093148E-7,9.5654334360466661E-7,6.0106692054337144E-7,1.8595744133201937E-6,1.2238997911134965E-6,6.6051046672399318E-7,1.6059720563640184E-7,4.7623793716272886E-10,9.6580916489607057E-7,7.5568602746217035E-7,2.8106899498931216E-7,5.338386940833573E-7,1.0248114403984423E-6,1.0661306510652467E-6,6.0783643642408691E-7,6.5781077466408642E-7,4.9187209606682381E-7,1.1936328290580089E-6,3.5877968328003121E-7,2.3642657287142139E-7,8.7107474526413588E-7,1.320824718223053E-6,1.4389886701171384E-6,4.4389849127930798E-7,4.8815796966744083E-7,2.9681459284705609E-7,{"$f":"'User Add-in Location'!E15","v":0},{"$f":"'User Add-in Location'!F15","v":0},7.8681174581697404E-7,2.8921569468438832E-7,6.2368081634465636E-7,5.2764791654052762E-7,2.4858468717158503E-7,7.205077774564836E-7,1.1742439933612347E-6,2.1986944900010398E-7,1.2126919895068288E-6,1.3499608269439515E-6,1.245413611573794E-6,1.3866436745242893E-6,1.424880067564686E-7,1.0136273402747228E-6,3.3690069088377106E-7,8.387632050348398E-7,2.4244779903836693E-6,3.4100792609034342E-6,1.8117249178098802E-6,2.1507208657988585E-7,9.5525298117678996E-7,1.4135164149488903E-6,2.1434324297738794E-7,1.3015800948452283E-6,1.0115736886280189E-7]
["Although the data and formulas are available for review they must not be changed.",null,"Machinery",1.3079282465618454E-5,2.9005145223010577E-8,5.1036833988482231E-6,1.3919981657112904E-5,1.2102475191582279E-5,8.7065280410150246E-6,1.570700561935739E-6,9.7589029345937529E-7,1.6062957557616704E-8,3.301582381498859E-6,1.0356491925259218E-5,2.5203049125667166E-6,1.8867113762817547E-5,1.4840238928798885E-5,1.8199481943464676E-5,2.2031646787867913E-5,1.8776869279895314E-5,7.5849427841489272E-6,8.1613088054957588E-6,1.7001264500647307E-6,8.1992097480947967E-7,1.4237997768629299E-6,9.1531742831241571E-6,1.6638208653805767E-5,1.1775629233731597E-5,5.4270902014062552E-6,3.251735407602234E-6,{"$f":"'User Add-in Location'!E16","v":0},{"$f":"'User Add-in Location'!F16","v":0},2.3838292852256752E-5,3.121221969163107E-7,1.0117866907657682E-6,1.5461091719664462E-6,3.6169756782592687E-6,5.5919493791430489E-6,9.5478781726621745E-6,2.8355100125996123E-5,1.2528763630068732E-5,6.6227269096065648E-6,1.6341508129297256E-5,8.6590709213007362E-6,3.4108394800579149E-7,4.9365222790733023E-6,2.3631746014167553E-5,4.9394011242504769E-6,1.1308644280200628E-5,4.3739529265498442E-5,2.3724954327781337E-6,6.2962372285864794E-7,3.7592506607050125E-6,8.426869106752937E-6,4.1333555518881655E-7,2.0461873692125201E-5,2.3315833561549723E-6]
[null,null,"Electrical Equipment",2.918616821556281E-7,5.4999581007234955E-9,2.1866212830137327E-5,6.0004746491652945E-7,3.2527970911159849E-5,9.854241955507456E-6,2.4173129341511173E-6,4.7358160861630883E-8,2.7929821387688128E-9,1.2380236243187212E-5,1.4816713039653665E-6,1.8950898337229758E-7,2.4020384171103594E-5,1.9246911008255605E-6,5.2358438391454332E-7,4.1952615044281719E-7,1.6241670574874993E-6,3.0693426688727953E-7,6.2507539269393364E-8,2.9494630100772013E-6,9.7387565636338444E-7,2.2661553365234062E-5,1.5365958972238658E-6,8.8349009489413301E-6,2.7139050084394224E-7,4.1456111690385111E-6,1.167844335979938E-7,{"$f":"'User Add-in Location'!E17","v":0},{"$f":"'User Add-in Location'!F17","v":0},3.7276659993842147E-7,1.6931909100018739E-5,5.5497502341991522E-6,3.3117172940362956E-6,2.2616434570045353E-5,8.1929721900931612E-6,1.0166582105534907E-5,2.4423683635006721E-7,2.1815303755642776E-6,2.8372043509108007E-7,2.9876250353187179E-5,3.1454178923192786E-6,1.2538026119603249E-6,4.7211318748959323E-7,7.0207246172394876E-7,3.4594934201047774E-7,2.2066473446276732E-5,2.9126573963567045E-5,6.8554211960950217E-6,1.5639659988224276E-5,4.791699097821144E-6,4.6796029266254304E-6,8.1597166277325846E-8,1.3442614436633894E-6,3.1135596668867438E-9]
["Any changes to the data or formulas will impact the analysis and may invalidate the model results.",null,"TCPU",4.9108267687843446E-2,4.8353863978332766E-2,4.2169651625191373E-2,4.7941396563282015E-2,2.8760796666206245E-2,4.0081138596210313E-2,3.4391421386476377E-2,3.4159052289741552E-2,2.6165706359966647E-2,4.0325706402305386E-2,4.1155566212902631E-2,3.535262520771363E-2,4.4941833501004072E-2,4.0447984607668387E-2,4.4015262113313969E-2,4.6360949160304692E-2,3.6018116717605006E-2,4.3888816678292662E-2,4.1922662533520352E-2,4.1428660339457225E-2,3.7386290912187516E-2,3.3181067208681289E-2,4.0594824415167825E-2,4.6204914510652173E-2,5.0423392493861852E-2,4.4886490083744478E-2,5.2372500378547598E-2,{"$f":"'User Add-in Location'!E18","v":0},{"$f":"'User Add-in Location'!F18","v":0},4.3829991865927134E-2,6.0215409611678865E-2,3.3889214645636004E-2,3.7346463173510133E-2,4.1156531291510527E-2,3.8442847176532895E-2,3.7083271999482165E-2,5.2187523189730148E-2,4.1757865613286829E-2,5.0355851749343115E-2,4.470574809680479E-2,3.8952778574465767E-2,3.1284764325861469E-2,3.8623229212291631E-2,4.531526910770476E-2,4.0659080173091375E-2,4.5019766054964432E-2,4.0600375073497799E-2,3.8519293906471561E-2,4.6742747731975939E-2,4.1978151362546706E-2,3.8793078753122177E-2,4.4943974397233501E-2,4.1224864261054761E-2,5.4995100851340302E-2]
[null,null,"Wholesale Trade",4.0789217891998374E-2,2.9516921857557124E-2,4.7548337179930081E-2,4.7462217100922924E-2,4.4468954563178724E-2,4.7565374489379163E-2,4.9473476019660914E-2,3.7008054240315683E-2,2.2732444236118081E-2,4.8186230270342925E-2,4.7454307156817636E-2,3.9174556879363671E-2,4.5875268943279916E-2,4.6768705259648546E-2,3.9653905006067199E-2,4.2036309563794567E-2,4.1173003030443488E-2,4.5101490096088222E-2,3.4326190355494626E-2,4.2701684951149302E-2,4.3975476964365219E-2,4.9231050768007233E-2,4.4249769359217685E-2,4.7842464101760261E-2,3.5137483709684385E-2,4.6260683157529861E-2,4.3122954208677226E-2,{"$f":"'User Add-in Location'!E19","v":0},{"$f":"'User Add-in Location'!F19","v":0},4.3866166787696163E-2,0.10377916008490036,5.3381749074307941E-2,4.9218551552721125E-2,3.771081743245544E-2,4.7389916248578016E-2,4.6953337799466671E-2,5.9249341081823476E-2,4.438023986702043E-2,4.5538082399258668E-2,4.5588809825077278E-2,4.6748399075063431E-2,4.8826213243770115E-2,4.330633857068561E-2,5.3106261016088091E-2,4.711474199144032E-2,4.3874526255301249E-2,3.9213669917617967E-2,4.1780395929407271E-2,3.6299055983328526E-2,4.2188817394474956E-2,4.5008037729078951E-2,4.1512777598108862E-2,4.5314188132871039E-2,4.2292843003780459E-2]
[null,null,"Retail Trade",0.11512955138468219,0.10908478457025693,0.10924158443069416,0.1092664301798124,9.5816556801184019E-2,9.4140979325512714E-2,0.1006055347360858,0.10766098560936324,7.8246001869098844E-2,0.10478424076462656,0.10328837533902777,0.11295579737616786,0.11859991343998641,9.5383257444296501E-2,0.11187054092014342,0.11269379069074566,0.11352842108020005,0.11045116964885283,0.11219743062016159,0.1129882695872482,9.8017242087178796E-2,8.8098324725936344E-2,0.10709016485759248,9.8006820893995164E-2,0.11916908786194964,0.1038885433439352,0.11263787101829217,{"$f":"'User Add-in Location'!E20","v":0},{"$f":"'User Add-in Location'!F20","v":0},0.11299123061726606,0.79457387116115108,0.11032404572613616,0.10044930151097912,0.11783098243661103,9.3943117613783517E-2,0.10032191161999769,0.11537701873687185,0.10352447758349723,0.10837768764557004,0.10112243124052911,9.7630342155112959E-2,9.5377283647999161E-2,0.11660122052461119,0.11909226754882636,0.11108085634468691,0.1006792258006836,8.6679086373705472E-2,0.10184767934515704,0.10874841270823056,0.10396004082964774,0.10084032611033246,0.12363643478575886,0.10400480965367537,0.11536867431151465]
[null,null,"FIRE",0.124946598504607,0.11419767090925331,0.14053773598339764,0.11360691089506729,0.11956311632902673,0.13060907538795952,0.14141326468333529,0.16126981627718651,0.16259977923519314,0.13339664006329841,0.12874459525544826,0.12502498852237837,0.13406431213014702,0.13705164274189624,0.11781616299321936,0.14268801065281014,0.12223405760382047,0.11855389289589481,0.11186768336229745,0.13356888620839644,0.13213331030837444,0.14145931475792473,0.11974371185535072,0.13089168869621326,0.11512138844073534,0.12587528016453714,0.1272501892817906,{"$f":"'User Add-in Location'!E21","v":0},{"$f":"'User Add-in Location'!F21","v":0},0.13455092078923123,1.1089529173528151E-2,0.14292056515746801,0.13536984858064274,0.12377137094789951,0.14327286017042334,0.12996082696419362,0.13111201140605541,0.13116210891481925,0.12053605903943002,0.1252608656762691,0.12919270218538531,0.15129609396292787,0.12015254823379228,0.14191291727078362,0.12067245786853696,0.12556282911043001,0.12007488329742046,0.13521668420353769,0.13140029060733663,0.12854801456166079,0.11928894827637879,0.11139221171352147,0.12993960818743042,0.13304344274062907]
[null,null,"Misc. Services",0.60182383261204198,0.63347370616626142,0.61333256098630873,0.61905001358946254,0.60631993203158663,0.61638705815002037,0.62836124291772277,0.60907440438224447,0.68968654989070377,0.61747790794195312,0.61802868285055512,0.62040236638158419,0.59458089055368835,0.60673665712175229,0.61234094703122033,0.59659635011675205,0.61777944149334074,0.62026736162749019,0.6259100025551747,0.61476019949643401,0.64655924418049848,0.63350442811126295,0.60840094945773759,0.59616628801331961,0.61774721295530943,0.62570689682980596,0.59995103109347514,{"$f":"'User Add-in Location'!E22","v":0},{"$f":"'User Add-in Location'!F22","v":0},0.61238176825025159,1.1410613259496447E-2,0.62244342521879348,0.61953780962825167,0.6191561378701701,0.62569727826191279,0.61320436702233994,0.58998937585568534,0.59959110048534814,0.60990280982928569,0.6216366077861023,0.61376866388496787,0.64130694357328388,0.62628241935782314,0.59779934138507973,0.62041573433234676,0.57718045076211577,0.54908812432295107,0.6049829643032284,0.62756152001318533,0.63045156026050386,0.60902158437810194,0.63715780191157823,0.60655432102896423,0.59607374860948092]
[null,null,"Professional Services",9.3434149200734059E-3,7.5123235120481344E-3,8.757965134280999E-3,6.9072238956950577E-3,9.9138955994110527E-3,1.0088275197969119E-2,1.0324513313785044E-2,1.0920179669275358E-2,9.5693065145463583E-3,9.2597188991578316E-3,8.8176094267502381E-3,6.0651887001167337E-3,8.7008136026926215E-3,1.021379651170138E-2,9.1041801368415103E-3,7.0775337029738792E-3,8.6082871125357924E-3,7.6192011186287361E-3,8.4844772752473863E-3,8.6062860967074661E-3,1.0239035173979958E-2,1.1665730056039565E-2,1.0086504005475193E-2,9.1514650924054662E-3,6.8206210054055465E-3,8.9881976969593321E-3,7.8684770560328125E-3,{"$f":"'User Add-in Location'!E23","v":0},{"$f":"'User Add-in Location'!F23","v":0},7.8324928957640254E-3,0,1.0069163113491044E-2,1.0832012811741719E-2,9.2813099576327523E-3,1.0498061077592666E-2,9.353089704606193E-3,6.4443522772798037E-3,9.0142779931513262E-3,7.6869933729786172E-3,9.2885792016024673E-3,1.033121994312022E-2,9.4938524748284635E-3,8.9938427569026917E-3,6.5692216851106003E-3,9.0288091940249095E-3,8.8012447996990185E-3,8.9053995859226191E-3,9.2330478415333078E-3,9.8661409451946281E-3,9.8053436650236084E-3,1.0079003242846772E-2,9.3463959667232262E-3,8.4636570087165287E-3,6.5448973259970827E-3]
[null,null,"Government",9.0689141877274698E-3,8.9085148707252534E-3,7.7995519765308293E-3,8.8491151039064801E-3,6.8764206454442088E-3,7.2905997711297677E-3,7.749161625198734E-3,7.7034306084110288E-3,9.1642856333505381E-3,7.2079780934586465E-3,6.9107423652695248E-3,8.3593532277888832E-3,8.857424525839307E-3,6.8911998116601807E-3,8.1258133367890593E-3,8.650407802758003E-3,8.387324012818026E-3,9.1765766792621609E-3,9.1787437356844019E-3,8.491052167857633E-3,7.8842920046254799E-3,7.1882882217186366E-3,7.7004809326821459E-3,7.5063519093176633E-3,9.529199642730803E-3,7.9786383096300661E-3,9.2211221330364985E-3,{"$f":"'User Add-in Location'!E24","v":0},{"$f":"'User Add-in Location'!F24","v":0},8.1198765674457638E-3,0,8.1110910449251374E-3,7.2108553212025146E-3,9.5642927531873635E-3,7.5648791081870462E-3,7.5033451226650238E-3,9.0512119948092905E-3,7.4308101356402555E-3,8.6467215943447136E-3,8.1672294803482089E-3,7.6693245355002569E-3,7.6306717079775615E-3,8.8086014739961731E-3,9.027858199150595E-3,8.1132955488085017E-3,7.4339881667459667E-3,6.0660356602406486E-3,7.3480942539642276E-3,8.4526212759951057E-3,8.3734577329749506E-3,7.7739755665293042E-3,1.0253698454914816E-2,8.1719077836368628E-3,1.0501113260462873E-2]
["To view the data and formulas simply scroll over to the adjacent columns to the right.",null,"Total",{"$f":"SUM(D4:D17)","v":1},{"$f":"SUM(E4:E17)","v":1},1,1.0000000000000002,1,1,1,1,1,0.99999999999999978,1,1,0.99999999999999989,1,1,1,1,1,1,1,1,1,1,1,0.99999999999999989,1,1.0000000000000002,0,0,1.0000000000000002,0.99999999999999989,1,0.99999999999999989,1,1,1,0.99999999999999989,1,1,1,1,1,1,1,0.99999999999999989,0.99999999999999989,null,1.0000000000000002,1,1,0.99999999999999989,1,1.0000000000000002,0.99999999999999989]
[]
[null,null,{"$f":"CONCATENATE(\"Source:  All values are averages for $25,000-$100,000 income classes and are derived from IMPLAN™ using \", D2,\" state data.\")","v":"Source:  All values are averages for $25,000-$100,000 income classes and are derived from IMPLAN™ using 2014 state data."}]

{"sheet":"Multipliers","index":10,"n_rows":231,"n_cols":59,"rows_kept":231,"cut":false,"hidden":true,"merged":[[206,2,206,7]]}
[null,null," Multipliers For Economic Input-Output Analysis"]
[null,null,"Year of Data",2014]
[null,null,"Jobs Per Million Dollars Change in Final Demand"]
[null,null,"  Jobs Direct Multipliers","Alabama","Alaska","Arizona","Arkansas","California","Colorado","Connecticut","Delaware","District of Columbia","Florida","Georgia","Hawaii","Idaho","Illinois","Indiana","Iowa","Kansas","Kentucky","Louisiana","Maine","Maryland","Massachusetts","Michigan","Minnesota","Mississippi","Missouri","Montana","MyCounty","MyRegion","Nebraska","Nevada","New Hampshire","New Jersey","New Mexico","New York","North Carolina","North Dakota","Ohio","Oklahoma","Oregon","Pennsylvania","Rhode Island","South Carolina","South Dakota","Tennessee","Texas","United States","Utah","Vermont","Virginia","Washington","West Virginia","Wisconsin","Wyoming"]
["Warning",null,"Agriculture",6.5663015045558328,15.007987862510836,7.0846371347429953,4.826203119125676,6.4064739508622397,5.3327562463783602,10.92911050768118,2.1427253941237847,32.548691043673088,9.8466682201793301,5.3003107956201037,15.700155296893501,4.3942043294119415,3.9758007039236603,4.9259886709375857,2.8565842192292377,3.3648775995019649,11.000360246278921,8.0091573924269834,12.25358869064806,6.7707329622302233,14.203249702918191,7.4627809434201628,4.1832733089772223,5.943993733603512,8.0674112781942782,5.8716795525144336,{"$f":"'User Add-in Location'!B11","v":0},{"$f":"'User Add-in Location'!C11","v":0},1.9400922797206936,5.0584565344618202,14.270528031944099,14.399031849449479,7.2012529050545702,7.8477384931179763,4.6722488171031573,3.6774966274772511,7.3894743190244023,9.5558103321369678,10.973628912630197,7.9622842868706858,12.478159874798642,8.8901394158803395,2.8738458192074252,14.213445769272573,9.068770211184944,6.1851950930645732,6.9827820154584952,8.7575038269827594,10.059155813895963,8.5532339583875689,18.067995755372415,6.0720271018909671,6.0865226650108992,null,{"$f":"AZ39/AZ5","v":0.18149646006810519}]
[null,null,"Mining",2.1217253173606982,1.1545064345650051,2.2579208180524302,3.3815852731898213,1.9009331827578337,2.4706544185030288,4.560099781423375,4.3441267428190811,5.4270365894704629,3.8621602818585825,4.1706590237824814,5.1325576339942822,3.9741334224092788,2.9996732076009116,2.5167932095734971,4.7575558372165849,4.8576760222946387,2.209793768067291,2.3092231612274614,7.2698137863822607,3.0838668795599453,3.9605628856714223,4.1434676681739697,2.3585410048996196,3.5617445102636367,3.0183302285014721,2.7152476241623149,{"$f":"'User Add-in Location'!B12","v":0},{"$f":"'User Add-in Location'!C12","v":0},4.3627959818079853,2.3153345550315967,5.0670945264291074,3.7325409322545151,2.5869083542754687,5.2739166867905771,3.4134655551633974,2.5400940438975459,3.1204572345899502,3.0839265602222388,5.2888486005257871,2.282537681469019,5.2339062068773359,4.8477577541185468,4.9183961619501533,3.4888015829998515,1.8761954307556152,2.3006834223650503,2.6863234146781592,4.4074662526448574,2.4715547976286518,4.3192093614218896,2.0904075373773989,3.808428888735564,1.6924850767937261,null,{"$f":"AZ40/AZ6","v":0.27128314099874667}]
["This Worksheet contains Data and Formulas that are an integral part of the JEDI model.  ",null,"Construction",5.658464877060176,4.6057365049848489,5.4247639321272834,5.8646477205794563,5.2907700337789363,5.6488630133970359,5.1653000162932292,5.7520762308525164,5.1720714934127292,5.6790833431967247,5.6240884963707005,4.7463855382954749,6.1614920079593549,5.0767309134163812,5.7371185378032488,5.5983909679329757,5.8302036251187861,5.636659357350732,5.4590925943538364,6.0965794466917975,5.3545600750139322,5.2317409317589663,5.6501982214357671,5.1408827060464866,5.6826704082238528,5.8122124012122924,5.7962149001328624,{"$f":"'User Add-in Location'!B13","v":0},{"$f":"'User Add-in Location'!C13","v":0},5.4737035332391999,5.3198732970846834,5.7915189489197223,4.9636517901362556,5.8265824754752842,4.9783949773331466,5.8338465889167663,5.4088768652049035,5.6903053622914763,5.7652501623115811,5.6259622413481294,5.5753756715730551,5.0348454645090879,5.7251580186870754,6.0139692436801093,5.7825696920447438,5.1774277772604078,5.4398943205661761,5.5936627499496687,6.1527195366279654,5.6487443989320569,5.2873420302948837,5.3823949361290406,5.6659916692785082,5.1476637268585703,null,0.39319969550500566]
[null,null,"Manufacturing",1.722263429314655,2.0265835353912882,2.3565202617840009,2.108720255723294,1.7752462288891619,2.0857658144441165,2.1699844529286261,1.5283380989668185,3.0894862979584099,2.4512487914785415,1.9932190474384643,1.9979140202041468,1.9073630041483662,1.7154571321289029,1.6580469796191133,1.754338828561423,1.6337242350759036,1.5472413139888725,0.66667775536000462,2.4137295854432095,2.1407379822127441,2.0905524253459324,1.7349949754370158,2.0609765588422073,1.7664804256879791,1.8184218102751089,1.1422024619457718,{"$f":"'User Add-in Location'!B14","v":0},{"$f":"'User Add-in Location'!C14","v":0},1.7157333002928972,2.6685376293624996,2.7023379683508639,1.6180798727756496,1.6392135189991905,2.2300188298741577,1.8230912520177891,1.7128117078258467,1.8113317084140179,1.8204848081159239,2.5514420998733982,1.9884483934260246,2.6747747215086366,1.8796633259019702,2.2548386315214444,1.8605223532282065,1.0457595924432921,1.7399416111437216,1.8842022630851072,2.5158190282071158,2.0703209132610683,1.5754586793177539,1.3881082712597104,2.2999526330332887,0.70009900424789651,null,0.57338151007865301]
["Although the data and formulas are available for review they must not be changed.",null,"Fabricated Metals",3.7209835041586947,4.0383095675852241,4.4303622921792476,3.5856534108156111,4.1632234207013763,3.7081430896026335,3.9175717489021582,4.1447204256930004,0,4.1780925851042676,4.0961077547654874,4.5605125100147434,4.6311624558960522,3.9622681431654025,3.9737127648621073,3.8672072178706891,3.9537980025861321,3.9979355240740428,3.4716445222133543,3.9164822479573691,4.1121969935370659,3.7849325330519097,4.0699657514327914,4.1142319942392955,4.1043371216553011,4.0671098050547814,4.133525838212269,{"$f":"'User Add-in Location'!B15","v":0},{"$f":"'User Add-in Location'!C15","v":0},3.6862968130082621,4.0612594674273232,3.8244231223333176,3.9946684103186541,4.4723972111213497,3.9126039394518224,3.9163701955865071,3.8685335567811641,3.8645038386670554,3.3616171969873152,3.9103008465069098,3.980617413433587,4.538269651372258,3.6473701897917725,3.7302720437689527,3.7144270513842748,3.6779035347990874,3.8694822977228864,3.8157598997761566,4.4849554111317893,3.6164525329339794,4.024883193213765,4.1468128416596395,3.9794223424864978,3.6237282971056497,null,0.45449397068689013]
[null,null,"Machinery",1.8864531527506188,2.3926352998241782,2.1335161605384201,2.3739389120601118,2.1136263813823462,1.6717336979927495,2.0251345874276012,2.9814345564227551,2.4821015845518559,2.2962201391346753,1.9004839163972065,1.8958374431822449,2.0214689886197448,1.7386777088977396,1.3715894953347743,1.5399549449793994,2.0114459865726531,2.3507561061996967,2.1373806966003031,2.4430518497247249,1.4634235280100256,2.4849712022114545,2.2930842658970505,2.2346510321367532,1.4996395095949993,1.6720305950148031,2.0740051371976733,{"$f":"'User Add-in Location'!B16","v":0},{"$f":"'User Add-in Location'!C16","v":0},1.540550944278948,2.19282685383223,2.7341875839047134,2.7671542956959456,2.1065858132205904,1.9552934512030333,1.7954321629367769,1.5481589594855905,2.384861194062978,1.964364015031606,2.4799304525367916,2.2488301282282919,3.2649322142824531,1.8414999491069466,1.8865631833905354,1.7975220486987382,2.0510711770039052,1.9050298763904721,1.8662967698182911,3.1965908838901669,2.8280915389768779,2.5036218599416316,3.1651613512076437,1.7290629112394527,2.3334209413733333,null,0.63327822787227683]
["Any changes to the data or formulas will impact the analysis and may invalidate the model results.",null,"Electrical Equipment",3.7477549455499135,0,1.1708865742529593,3.0169146650580951,1.3193218951584191,1.5137559611310241,2.4553771454800843,3.5709360056026007,0.67579817323274516,1.6767637063098211,2.5358411804322274,1.1498477817863546,1.1241177346116753,3.009896796236756,3.2620947207173994,2.5015151654520342,2.6689459969920497,3.7028671336430374,2.838088486784248,1.522556991987331,3.0526045009654057,1.3693274182658042,2.9302084548498994,2.3110433188817834,2.7555427935815628,1.9274731156646565,1.756795569132733,{"$f":"'User Add-in Location'!B17","v":0},{"$f":"'User Add-in Location'!C17","v":0},4.0641686326713975,3.3299479612740139,2.722707276703209,2.3422555949098323,0.98382626297653364,1.835241634358642,1.3262980048374464,3.2208418205220215,2.312894485330069,3.1867271674576627,0.5630010725349508,2.4273488290848273,1.8431395946010467,3.682804548612205,3.0627337758259108,3.0146494065561602,1.2405537712958552,1.3585892531179613,1.4566755294799805,1.4598530736020816,1.6961507963877853,1.8362129426771594,2.4769330281083302,3.4398664223250521,5.0323429158938833,null,1.1501490058433366]
[null,null,"TCPU",2.2836088857715215,1.6459864953453962,2.4596742636281288,3.2843342756979066,3.2027370950922087,2.7108330084564249,3.0112611205923052,2.707828263547742,4.1665950662849722,2.7107788234026735,2.8044262089283172,2.2415998564713027,3.4143175613154977,3.4526498132819001,3.190412520938223,3.2651392204063465,2.5789943439432075,2.8545912368066029,2.4305787265449177,3.315745535035949,2.8147679774712855,3.112142899586865,2.6751604160775666,3.0420095314126301,2.789842393550106,3.1442156298565127,2.6050812329570832,{"$f":"'User Add-in Location'!B18","v":0},{"$f":"'User Add-in Location'!C18","v":0},2.7440330633613317,0,2.7854164389688658,3.5178034372577374,2.6726474694109861,3.5644827130764498,3.0510917270535547,2.7501171724264495,3.0105004634606121,2.1304996028908287,2.9450954300192742,3.4605247842930509,3.3896560147325152,2.4589884553418724,3.1436790600657587,3.1828022760583257,2.6255466522418995,2.9702788521411452,3.5666303698255768,2.6147911486698612,3.2681811601400628,2.9608058812396885,2.5010163116522928,3.306148810982068,2.1112411786381013,null,0.76576689381237928]
[null,null,"Wholesale Trade",3.9408817359787265,3.5149118446304413,3.6856528305008029,3.4811726079015677,3.3753966756923472,3.6626469629253458,3.0256775576197459,3.3663703110403644,3.1378673473518055,3.5768389707553889,3.4624823621647089,4.3872869565815273,4.2342134058832412,3.3890594676583117,3.879410329693092,3.9997207767235308,3.713357157336024,3.6677167949562302,3.7160030347858362,3.9159248306365786,3.5362717160207784,3.3808728886221697,3.5648932148596484,3.6579341728530248,4.0494564758803318,3.8527005612493279,4.0830311129906933,{"$f":"'User Add-in Location'!B19","v":0},{"$f":"'User Add-in Location'!C19","v":0},3.9707274956617526,3.8267372234138901,3.677236958463749,3.1302050713293568,4.3849579948151183,3.2056023423543234,3.8267589243586193,3.5577945492224781,3.7673278163293165,3.813662199488657,3.8620458888436509,3.4567885256099133,3.7126799240797581,3.7206224698506429,3.9338207399059915,3.7015583946319399,3.2614073453549142,3.5235430883076377,4.0378796360449876,4.188429735377877,3.6395854099068101,3.4557345967092914,3.9255289317605024,3.9734831061905731,3.5225051280267228,null,0.5460642210265354]
[null,null,"Retail Trade",11.956310142203314,12.349292427551084,11.119490757845597,12.828276082203757,10.244031208122585,12.190173326333969,11.054522692294677,13.111782376855182,11.228455379366965,11.930670038035872,12.374458776388291,10.963848250564146,12.605020897858759,11.981935021719313,12.716494900165218,13.698202814478414,12.329884579230699,13.613723014750194,11.971938694694618,12.812100337828195,11.814157571669126,12.584338656655724,11.826136685652489,12.215539386775415,12.634674936601067,12.997162245106171,14.285715844734698,{"$f":"'User Add-in Location'!B20","v":0},{"$f":"'User Add-in Location'!C20","v":0},13.050872128697996,7.7923411051916514,12.737382226378884,10.861965778667511,12.952496700039912,10.887379304198754,13.45326683090919,12.232234560435543,12.204906311093263,12.484809736758811,13.785826056945988,13.023422977711895,12.024152084606255,12.666431768378137,12.828053085838487,12.019563195547438,11.103076792453322,11.764659543120944,11.812326135657166,12.469190139944828,12.340154949981388,9.5760415659001659,12.811300595843511,12.844840502975011,12.389821345263188,null,0.2437455218705093]
[null,null,"FIRE",5.57680297969842,4.5384933120094288,5.6283418839469297,5.5530656750971517,4.4063292678624038,5.4248188372230057,3.4375406761614546,2.9675155417541839,3.2697747735613119,5.7807741234895973,4.7101040149539006,4.5565237543679951,5.7070093314754029,4.1292172070388782,4.8554445719474462,4.0853478666182967,5.3158939084581691,5.1917177409947728,5.7430369732190503,4.5612570073324576,4.3723836381019696,3.631232682706111,5.0829858947060691,4.4720119188708942,5.5064103002685858,4.9592969872649917,5.9117140975992477,{"$f":"'User Add-in Location'!B21","v":0},{"$f":"'User Add-in Location'!C21","v":0},4.4684303300152566,0,4.2202861052101461,4.3068430666513882,5.009788510157116,2.8283993900083542,4.2516533553010794,4.954991794507051,4.0598304690943721,5.5698752351007315,5.1121149363767282,4.3187331219623486,4.0460455642947517,5.5628122416931101,3.9816739615145349,5.0208402049997698,5.5134869551721604,4.4698606886415195,5.2353079315147175,4.6553359884453371,4.5982341230448283,4.4924454183675664,5.0647810405825044,4.3230310285891136,5.6960828670123158,null,0.39683903722799541]
[null,null,"Misc. Services",5.9663844575048257,5.4210609965518959,6.1861656314031972,7.0145385293628246,5.0334249768802533,5.6137216449755138,5.238210304806092,4.0748806725010693,3.3009842280444959,6.2545018756730961,6.0543704024481988,5.9029378842021618,5.9261765429635256,4.8994076967563718,5.3456796378982894,6.2794392389772691,6.4586095421179017,6.6314483853649255,6.1841715359583995,6.4635894024641756,5.0080656265732388,4.342149864165247,5.64989379166121,5.6061709736138923,6.9544674383701421,5.7116292490386282,7.079556797394698,{"$f":"'User Add-in Location'!B22","v":0},{"$f":"'User Add-in Location'!C22","v":0},6.0657102688676847,6.245225194727305,5.7786999460127513,4.9241055203795208,4.8681872779500921,4.5737785300247582,5.4841041999253735,5.9837715631601256,5.9259750648553062,6.710986315996518,5.5919951063076638,5.1228349211018411,5.9234286628920838,6.2953378061656835,6.7181013478346179,5.7902110895098611,5.4769990971932225,5.328985501095695,6.3194585005055348,6.513734697209637,5.018896626312829,5.3165567427237796,6.0695553151465145,5.947434758800771,6.6981384666109962,null,0.47777200577493861]
[null,null,"Professional Services",8.6761030893874125,7.0509573724388508,7.8739005379187015,7.7249277735744055,6.730931977633321,7.010025719784573,6.6360153563914706,7.5659203035763118,6.2559808361161515,8.2157760583184789,7.3991403963654943,8.0554225791403908,9.1265080327058286,7.4002404480447268,8.5660456667570823,8.7196366660790545,7.7231574201348554,8.4843075925569735,8.1813393053821244,8.69431565670574,7.1026512424021098,6.9174420910270564,8.3323085599157558,7.5726062032581964,8.9733134484033972,7.5152390937993401,9.2923086146297287,{"$f":"'User Add-in Location'!B23","v":0},{"$f":"'User Add-in Location'!C23","v":0},8.2772212872908852,7.9055101310111322,7.5505011107309246,6.6941554751384365,7.9233361936854045,6.5707528309695089,8.2043953434846877,7.8487056605970595,8.0747577217186066,8.1497098915387163,8.0605840828834872,7.4360024884668716,7.5192604538896362,8.4649391150793889,8.5460690526017888,7.9970738920365525,7.5038205393500457,7.4449772344150045,7.941773095867064,8.7269171882902548,7.037438719329205,5.9680754187407148,8.5315296308168183,8.0656572941904123,8.3444100293305361,null,0.31518827951246814]
["To view the data and formulas simply scroll over to the adjacent columns to the right.",null,"Government",8.6573833358453012,7.8686304794968169,8.1818339482091105,11.918219563562795,6.7706171727197866,9.7113620165401269,6.5802548402943462,8.5829000236516801,4.369121567860387,8.6896008749585523,10.183667310218059,8.098019677126695,11.166429910583274,9.2436109010013325,11.812686777567011,10.931989468769988,11.405731706181031,10.062863506425654,10.2648566257858,10.414893976708209,5.8156384100103624,6.4684425064632265,9.650036194131463,9.5888723370630657,11.859017641330443,10.395275426206581,10.626711929566142,{"$f":"'User Add-in Location'!B24","v":0},{"$f":"'User Add-in Location'!C24","v":0},11.165118230684755,7.3103160051252614,8.1820844758782911,8.0011388721646917,6.3706094570006879,6.6442355379233993,10.440893004185783,10.324770238084744,9.0618881827979774,9.0414318805363472,8.7449818513064734,8.4221817367186436,6.8562026903804938,10.175397503558603,10.569807840732654,9.9890336406048323,9.5401622583012262,8.3704796873853642,10.320112338299129,10.729227213508278,7.0936845700119981,7.405113600710723,10.044000528225666,9.2135571550053452,10.038588651856047,null,0.38668354312904846]
[]
[null,null,"Jobs Per Million Dollars Change in Final Demand"]
[null,null,"  Jobs Indirect Multipliers","Alabama","Alaska","Arizona","Arkansas","California","Colorado","Connecticut","Delaware","District of Columbia","Florida","Georgia","Hawaii","Idaho","Illinois","Indiana","Iowa","Kansas","Kentucky","Louisiana","Maine","Maryland","Massachusetts","Michigan","Minnesota","Mississippi","Missouri","Montana","MyCounty","MyRegion","Nebraska","Nevada","New Hampshire","New Jersey","New Mexico","New York","North Carolina","North Dakota","Ohio","Oklahoma","Oregon","Pennsylvania","Rhode Island","South Carolina","South Dakota","Tennessee","Texas","United States","Utah","Vermont","Virginia","Washington","West Virginia","Wisconsin","Wyoming"]
[null,null,"Agriculture",1.3195139210020899,0.57032354145798536,1.1653534394962377,1.8343318182980095,0.78346690047577694,2.0262411450500903,0.47801404134830378,0.90705697817150732,0.50293721365509236,0.95650180460474332,1.3053112636561,1.1653477122883675,1.6603899698941409,1.1687189922926391,0.90446848475723374,1.2108440379812528,1.7428415134569306,1.2219709801577103,0.72523960531645115,1.4573191331752422,0.86596692076232662,0.43859285140392423,1.0059357902516533,1.4369928633569864,1.3585006613208734,1.4740024897016595,1.8244932933492493,{"$f":"'User Add-in Location'!B28","v":0},{"$f":"'User Add-in Location'!C28","v":0},1.3663291408502685,0.50364043296431982,0.86689472843732818,0.42555772629093896,1.4835006548684087,0.97451060066687722,1.0091634809728889,1.2513936924192355,1.0615265243592218,1.7231343957180907,1.6779696344522728,1.1627074694601223,0.48272016987265043,0.96002567379013293,1.4909083891624688,1.2864781587469079,1.5284968725883268,2.5160479164897831,1.2349529240547563,2.1778247921005476,1.2737948478316745,0.8879994894396791,1.3052372190400616,1.9357721240981829,0.90768922101176963]
[null,null,"Mining",1.3467413722604946,0.3854762229366579,1.7609998868859333,1.5724012402520664,1.0656654247339221,1.4428833947665449,1.6201880634694861,1.4929582899895268,1.2472158791362375,2.8130057238150337,1.640434375707654,1.7586293427840525,1.9186764316282412,1.8142766261446304,1.6917733731477158,1.5867198999377266,2.8907508297242983,1.5826005244600601,0.98603520877119433,2.762200092923814,2.0980579403863437,2.13432945030323,2.2772228130395864,1.5445205025050952,1.6091708722321885,1.8243297632189766,1.8873560670493306,{"$f":"'User Add-in Location'!B29","v":0},{"$f":"'User Add-in Location'!C29","v":0},1.6351392441901609,1.0256204052247864,1.8015312802964363,1.8419130021247312,1.4133694275565769,1.901746860448865,1.5916983010112375,0.98603121439615893,1.9645499492037124,1.8762169298918352,2.2588303607443105,1.3548967112665591,1.9247521110202956,1.754068706346595,1.9597141708152883,1.6839620203211689,1.0913117795750715,2.0574631069017495,1.717369328374448,1.5065302365068076,1.5890234795169556,1.7095755977907043,1.5491699550462807,1.4011501643968667,0.88815046393353014]
[null,null,"Construction",2.8524229298181676,1.9416188101673797,2.870700918963748,3.0196375131301587,2.9360729408600177,3.169258980854897,2.5532904285257403,2.6944461864664491,1.2707790245542459,3.4065510809688826,3.2325781999223895,2.2205186831806043,3.4000618244729539,2.773124388133311,2.9611464935873348,2.9131867115807641,3.0551804966227052,2.8845992621361329,2.3965543652100108,3.5977053354368387,2.3654046615372093,2.6301875953717082,3.1454679186263195,2.9770112918936849,2.7897154159991882,3.2617896250774279,3.2151159692620102,{"$f":"'User Add-in Location'!B30","v":0},{"$f":"'User Add-in Location'!C30","v":0},2.9174709206281144,1.0288482353826274,3.317632951620372,2.4576953500604719,2.6965448899119422,2.233649440792262,3.3720401796601203,2.4603203199827695,3.2867209313390804,3.0710648367757756,3.1264255251508732,3.1122567773552601,2.4861400985778865,2.9830406332993493,3.0952053799375672,3.2808215659371864,2.882276963607231,4.5359339374215999,3.2038248720114084,3.2296791896844503,2.7259012883019555,2.3126821224694067,2.2884661386900418,3.1684191359074583,1.9101632538703219]
[null,null,"Manufacturing",1.7196063792779104,1.5137740180773516,1.9070028343595831,1.9438472919298528,2.1425552439571613,2.2069593010806581,1.2877870797942794,1.3818146461340681,0.66783594058428331,2.2369546058194216,1.8277816656722212,2.2081797751623955,2.1859821463507876,1.8437573613825995,1.579410516949618,1.722338654650287,2.181515129147626,1.7093222780525565,1.6226980245167626,2.0997135034925263,1.2603738277121912,1.4176902925636234,1.8602474388198063,2.0701627121006787,1.8425147756112974,1.9205750805965209,2.1731459686252301,{"$f":"'User Add-in Location'!B31","v":0},{"$f":"'User Add-in Location'!C31","v":0},1.7578243830901503,1.0973042203738537,1.5038100804395584,1.538768205729967,2.0845118308946882,1.5365315057505109,1.6867017916724723,1.8267692010412842,1.9707020528837647,2.3268712215447063,2.2100139056184394,1.935594616699905,1.4749821361364648,1.6041364009051462,1.8284340744921563,1.8382150777910262,2.3477599295163185,4.0691216806034216,2.2874798164743892,2.1960466123916524,1.4400618514694348,1.6559518400439828,1.6329893063423357,2.0627771798305607,1.5745506183344513]
[null,null,"Fabricated Metals",1.5350727987725561,1.3472167675088091,1.931791671165606,1.4335709457717292,2.2314757370367282,1.9140012736727552,1.3534657708028468,1.2335007430576697,0,2.166902548656231,1.7705566439686753,1.722141222255986,1.8684941203129002,1.8004963892262158,1.6032953291404539,1.5209898530710035,1.5880798210458058,1.4774118988979155,1.2971914032610452,1.732763509197933,1.3936610861522396,1.4765990561828382,1.8303083392178141,1.9155843606809291,1.5029968815605816,1.6822440958604581,1.6965238277505084,{"$f":"'User Add-in Location'!B32","v":0},{"$f":"'User Add-in Location'!C32","v":0},1.4842283409543153,1.1568305288873069,1.4785960887263461,1.5026922102381544,1.5779126889821959,1.4691663260866956,1.8727090489573595,1.3907245731935269,1.8648121349695252,1.5381019169964443,1.8323340793935265,1.8171486680100604,1.679542800275291,1.475785518928272,1.4753792133273149,1.6621813966733654,1.9939217011376125,3.9193400464406829,2.2051672757398793,1.5924609761412551,1.3316338480245777,1.5403302311897278,1.2967117079874364,1.7808918545885783,1.1075969396567926]
[null,null,"Machinery",1.782071680878289,1.3724407239351422,1.8208202242385596,1.7626156406477094,2.1732648452743888,2.2188616353087127,1.4587514041922987,1.2291525106411427,1.0605147699825466,2.3882860718294978,1.8684619824634865,2.103107777191326,2.0572034120559692,1.7693511871621013,1.8066850011236966,1.529336059698835,1.8906857343390584,1.6992855791468173,1.5099613817874342,1.8850409768056124,1.6448956232052296,1.5923566890414804,1.8781136891338974,2.2405931509565562,1.6511377728311345,2.1562412017956376,2.0803293455392122,{"$f":"'User Add-in Location'!B33","v":0},{"$f":"'User Add-in Location'!C33","v":0},1.5884725378127769,1.2288776661735028,1.2354379529133439,1.517498712753877,1.6786485665943474,1.5102791707031429,1.7303462538402528,1.6018982490058988,1.993967364076525,1.5896976152434945,2.0040470063686371,1.8811527632642537,1.436684921849519,1.5757030642125756,1.77649656299036,1.8492206644732505,1.9986162746790797,4.1365373749285936,2.2577574665192515,1.4435093749780208,1.5095256697386503,1.7010848354548216,1.2458342234604061,2.0101678669452667,1.3789334602188319]
[null,null,"Electrical Equipment",2.0019834400505148,0,2.4190030661962365,1.9636231186569377,2.4681934695090018,2.4386219311785955,1.7857004775795886,1.4769086504495272,0.66183697215972415,2.7434737015795965,2.2515174112012311,1.9519902813819148,2.2755275182826544,2.0878442025953725,1.7846105406361241,1.8882310698109288,1.7679703389444659,1.9887523240940546,1.5611928304036458,2.0580461384147726,1.7869455532361103,2.1120938998396679,2.3712453047434487,2.7171017533989361,2.0425831246119674,1.6765104686060259,2.4242581859711678,{"$f":"'User Add-in Location'!B34","v":0},{"$f":"'User Add-in Location'!C34","v":0},1.8507539892709384,1.1000424226125081,2.0561217184989684,1.9696268702066073,1.4379032786174488,2.0641963968994799,2.266683445181898,2.0335874121676207,2.3400579908842682,2.0245016492823118,1.1016717290365567,2.0718441522249611,2.1737614216343051,1.6759982775616389,2.1394741330095517,1.9398917946764218,2.2382921275272163,3.5845567180264379,2.796452522277832,2.5631668234384191,1.9617404578834452,1.9049834846168436,1.7920285040332424,2.3065498951942689,1.5879177483179236]
[null,null,"TCPU",2.423218054349038,1.2342512621145068,2.4174778826166325,2.3862633884949687,2.3183814552236561,2.5179594728455599,1.8577201032248394,1.9645218289394641,1.2280234248983355,2.761678793471888,2.462624134690004,2.0061166640152415,2.5991948074990852,2.5640599328994069,2.4222971380329437,2.2455372271780356,2.3143201017668136,2.3146077876666058,2.2749381291828135,2.3370009091179464,1.9731850088045546,2.0891658203833385,2.470016261768782,2.7437910674009318,2.4216232688263273,2.4284108651994769,2.5005747953032902,{"$f":"'User Add-in Location'!B35","v":0},{"$f":"'User Add-in Location'!C35","v":0},1.5781557623579254,0,2.0714392718875252,1.9463964692641305,2.1838647633080632,2.214101171289971,2.3058488655667082,2.1097568296020626,2.2944220183625927,2.3235311017092415,2.2540041010221183,2.3446589103164048,2.0356201961853886,2.2625905952602889,2.3969038636266271,2.5896155328692934,2.4465504599313044,3.7249664440141457,2.9207918262278127,2.5111654477372198,2.0534900136368845,1.9283872860176035,2.1991013249058349,2.3566935025937443,1.7122121109143138]
[null,null,"Wholesale Trade",2.1567287382251488,1.5377772588215903,2.4744670102696218,1.8527234791281695,2.0756591268642222,2.3889636502294485,1.6162892295928772,1.6304765292984285,1.2026884672884457,2.6623472385063858,2.1436852420875412,2.3754275835916667,2.60957299763571,2.100241179095057,2.1693799795504818,2.1390981537139346,2.0936273043741012,1.9905105567977814,1.9160468358479574,2.4326763135944298,1.8865818663271603,1.9212755351723312,2.191256579096446,2.3142219115160185,2.1145777239770949,2.3605951925951563,2.4139131854394238,{"$f":"'User Add-in Location'!B36","v":0},{"$f":"'User Add-in Location'!C36","v":0},2.2989604150463721,1.7487345992448089,2.1041236009426463,1.7726787255909628,2.1587841861976123,1.6503455867310486,2.3417194651986311,1.7903041919548355,2.3147537893877774,2.1874179685901027,2.3533757386807199,2.0401328378094887,2.224922114503598,2.1134906294816984,2.1240675880523501,2.2467958478870509,2.0266690394121731,2.7373629004655484,2.7819280424517787,2.4686765430930131,1.910644119513963,1.7368695053511751,1.8573490559697865,2.3402429820534714,1.5095844560040685]
[null,null,"Retail Trade",2.0260876585124379,1.6484070434337887,2.3893890380859375,2.0948806938467732,1.916296427974425,2.5153631775413681,1.8060475623253549,1.9619050058624896,1.3182962995763055,2.7943701399071745,2.3761489647359042,1.8191524049478547,2.5091927158678207,2.308811226966085,2.2328223049050511,2.3169770135465506,2.1737336415147746,2.2698047743983971,1.8928513603181396,2.4582375986196574,1.9474335268809426,2.1405304678505099,2.2323216825428576,2.456390937956253,2.0450620520505303,2.5019054812324564,2.6541591602159835,{"$f":"'User Add-in Location'!B37","v":0},{"$f":"'User Add-in Location'!C37","v":0},2.3971410723742146,1.7168158802110915,2.2364314428650509,1.9007825081528187,1.9502115779856373,1.6927752600130197,2.5087306029181033,1.9920292176641041,2.3373744642108067,2.2377031490445045,2.6191173859979031,2.3902093781284584,2.1908560009830707,2.1944687212139979,2.1709090208880157,2.2466122568425386,2.1837416109199843,2.8524127801864636,2.6908460923577664,2.2477218652624988,2.051322070497279,1.519347673141584,1.8483201504116828,2.4125063279523071,1.710030163505653]
[null,null,"FIRE",2.672926329158182,1.515002522887648,3.4035654464931229,2.4859414340515751,2.1522716907496626,3.3813058603707535,1.8894723238527358,1.1910611308537575,1.021411763344916,3.8782614463666718,2.5206457322205904,1.9102455392154354,3.4774914441595612,2.3360898510943997,2.3221651436528621,2.1954857347477059,2.7300851174584939,2.498029581053852,2.4292389397160883,2.4981425160870621,1.9629087845808639,1.9163497232987663,2.6916940369150035,2.743977492692943,2.6416492449405373,2.6072714565247948,2.8128259676969072,{"$f":"'User Add-in Location'!B38","v":0},{"$f":"'User Add-in Location'!C38","v":0},2.5270443215417053,0,2.2711025702299086,2.2535448156313107,2.0640985743371991,1.1866969659716209,2.0492375990396932,2.2722765481154563,2.2647062578247859,2.9818195834000121,2.590588948433576,2.4778246839227909,2.1973099998406096,2.6919936790595695,1.7575095590794156,2.5297829960970524,3.3186301046214837,3.0308916768626357,3.2499555859993192,2.3562123238665453,2.0671701340105977,1.9623932908002433,1.8575954999627611,2.4726620046022103,2.2930242620190442]
[null,null,"Misc. Services",2.3910457932758997,1.6872993097759461,2.8167665536667048,2.4472002656843692,2.129539620189739,2.6459747610962085,2.0079742663516553,1.6015925083606635,0.9365368547555214,2.9490561693554245,2.3509603377079729,2.1721938182092746,2.8476026333302009,2.0516714342086049,2.1106139168250611,2.326551285582847,2.5336463717801196,2.364222313554126,2.0196868879569845,2.8377173809322729,2.0633253086037349,2.0242493121406437,2.5871981772916537,2.5074699387960355,2.3919638218634534,2.4531672446470925,2.7195597789985051,{"$f":"'User Add-in Location'!B39","v":0},{"$f":"'User Add-in Location'!C39","v":0},2.4200230615631551,1.7997112690671078,2.3975191566420326,1.9498563132417308,2.216516933453772,1.5855553474017079,2.4285385110528406,1.9981663782375814,2.5512655702869815,2.4298677701117906,2.2140313472644877,2.2509576922895764,2.5592845644792068,2.4844873682256119,2.529309421044057,2.3233081913521887,2.2408511035715306,2.8962941414795997,3.1976797411852416,2.7487790692432723,1.8316755433940817,2.0190344629535724,2.0028649139152943,2.5271572873295671,1.8427419456872172]
[null,null,"Professional Services",2.2485344625336445,1.6940804869606547,2.786096653557967,2.0681908550518697,2.2641617732642918,2.5583183852149558,1.8679940626367952,1.7764663393404252,1.2540107138619863,3.0291206831753157,2.6050512113029556,2.0911396809105098,2.7547447302282393,2.3779036032183081,2.2654415631171574,2.2164816053739065,2.3124545825485163,2.2762393676835759,2.0546406689293053,2.600950117737137,2.0279425678346907,2.0759849149020226,2.4961478969454305,2.4734324153823848,2.2973736938845803,2.561215368158912,2.6549661688660153,{"$f":"'User Add-in Location'!B40","v":0},{"$f":"'User Add-in Location'!C40","v":0},2.4141143133671177,1.6149578509463047,2.146222899290863,2.0144635562269992,2.3229893116928744,1.8177502607961602,2.5125792995054921,1.9185261663098254,2.4354135121785232,2.375861164924435,2.5052645414516959,2.2132499220214039,2.2941113784623859,2.4325773429023374,2.255512267820829,2.3744448821727948,2.4684056026516106,3.1505160258361928,2.9228301041738702,2.4796083811982212,2.0037824238083783,1.8942858383363781,1.9035416785710964,2.3251632876977779,1.7216079062950178]
[null,null,"Government",0.53413935215433173,0.17361487688416552,0.83888631524351021,0.4782421611504864,0.48384951293077194,0.38169486117484708,0.74524362029862345,9.2231681623396261E-2,3.4680529287659627E-2,0.50946477031638204,9.0149270105674958E-2,0.27260681628137501,0.70450853936260061,0.23166070168771333,0.3189855515739502,0.42979218436365663,0.50659168070898186,0.48332452182783686,0.62630162006047063,0.5674986272376441,0.12214300982018268,0.16498842733259361,0.38246958208814491,0.76995929186575429,0.40165649096866668,0.47691213049912956,0.58833550815596192,{"$f":"'User Add-in Location'!B41","v":0},{"$f":"'User Add-in Location'!C41","v":0},0.43485140713525461,0.76419077260402068,0.3241086030510722,0.24885775067352361,0.58543090312520918,0.44448076522237273,0.26270778191341787,1.0879323605983298,0.35099086024133413,1.1407282743725264,0.59224820780458454,0.46991171722078218,0.21282245711111658,0.49516075740844817,1.2162974724188762,0.6544891742786989,0.43773407104848339,0.61062130068967502,0.36677889055270163,0.24207674857041506,0.36115877303131128,0.71864739549499113,0.44306536367737753,0.59835102991150035,0.40770426081706795]
[]
[null,null,"Jobs Per Million Dollars Change in Final Demand"]
[null,null,"  Jobs Induced Multipliers","Alabama","Alaska","Arizona","Arkansas","California","Colorado","Connecticut","Delaware","District of Columbia","Florida","Georgia","Hawaii","Idaho","Illinois","Indiana","Iowa","Kansas","Kentucky","Louisiana","Maine","Maryland","Massachusetts","Michigan","Minnesota","Mississippi","Missouri","Montana","MyCounty","MyRegion","Nebraska","Nevada","New Hampshire","New Jersey","New Mexico","New York","North Carolina","North Dakota","Ohio","Oklahoma","Oregon","Pennsylvania","Rhode Island","South Carolina","South Dakota","Tennessee","Texas","United States","Utah","Vermont","Virginia","Washington","West Virginia","Wisconsin","Wyoming"]
[null,null,"Agriculture",1.7947073124742314,1.6491502221769507,2.02684945634318,1.6601505521508451,2.3698010044588287,1.697127758408109,1.2502609325197296,1.0384184678610671,0.49342820770201729,2.7813724800440229,2.7812697993886326,2.351654959950944,2.4720465965942053,3.2094080419114541,2.22321986894001,1.6693300391082351,1.631726010403872,1.7397758209011713,1.9559177823253833,2.486824429244892,1.3239496434976994,1.9815114470392829,1.9281983007758816,1.9249339968329031,1.9874802203559101,1.8448929941541288,1.4061278151562475,{"$f":"'User Add-in Location'!B45","v":0},{"$f":"'User Add-in Location'!C45","v":0},1.7628566731619415,0.97457411131129701,1.6511368474069887,2.2999859314326181,2.1487103263483318,1.3860389176499053,1.8795810558799155,0.91384494675673722,1.8597209398736811,1.0157849514436013,2.5277993288672502,1.4654693590610695,1.6927369331313407,1.8118807543598427,1.9153419463657075,1.5337669265447675,1.4060796452471949,3.6344423423116683,1.2551701723803363,1.5894559436302547,1.059209868775653,2.0604728710344906,0.41430570598545513,1.9861913940419365,0.66903145774614181]
[null,null,"Mining",1.0996796428293423,0.68857304255167651,1.7076393832331118,1.4410644268644031,1.5157225857610288,2.7193033246026523,1.4962161727573562,2.4153802567634033,0.51360191124072974,1.6920703666797583,1.992067903712176,1.2556379014167234,1.6592180417931599,1.5999781705331113,1.7354963896931082,1.2912213214929553,2.1900451079658843,1.2247926325037861,1.431481098783189,1.4599095358364824,1.3134437920390696,2.1135309744572295,2.1388470884682476,1.8233520811882573,1.9010893158290698,1.5815147593401482,1.9660557111104331,{"$f":"'User Add-in Location'!B46","v":0},{"$f":"'User Add-in Location'!C46","v":0},1.6118601439655691,1.0223827292953713,1.4890356962231623,2.5550872830377109,1.4709518681401792,2.1420602107393569,1.1184051555135976,1.3933503247689509,2.0752735552580459,2.4984703063964844,1.700408507084501,1.8275771901227427,1.8017882125965063,1.175511678059896,1.2790713724882707,1.4423165459563767,2.1524512249490488,3.4712566431017891,2.0673195797464121,1.1956712888634724,1.6940641472305078,1.014519214630127,1.2518468870632891,1.551024519878885,0.79348066233206493]
[null,null,"Construction",2.2048804339577495,1.8046295557321455,2.8358066793361738,1.9048106057150558,2.6419363354048158,2.8614471728491675,2.3583991367186132,2.0671083694998078,0.61886739214401376,2.8695018221597346,2.5988470178472163,2.2064078792328257,2.2220004550697405,2.7923303877673495,2.4260598269889631,2.2481988001373776,2.2255427556340317,2.0898346283128824,2.0664937102512089,2.5934882344610029,2.3806282145941893,2.5295973027615419,2.7353245485752993,2.8111339616974069,1.8571133888699471,2.7539172523453934,2.1852724630812816,{"$f":"'User Add-in Location'!B47","v":0},{"$f":"'User Add-in Location'!C47","v":0},2.3270581047325698,1.3857808610439912,2.8844033892073746,2.5688839132857582,1.8088188959305902,1.9202916112410418,2.5972575385703403,1.8803687545445238,2.8968569991070821,2.3345703541812495,2.7443796949918111,2.9037527714609563,2.3651424372219108,2.1455647939294673,2.0434106991200931,2.956966583466087,2.6930155415018731,4.8574795735180185,2.9139170312942562,2.4192474483298154,2.2141768994581845,2.0591280246529342,1.9243731304363589,2.6460780707557259,1.2087551345243277]
[null,null,"Manufacturing",1.1088404815041355,0.76150424895753865,1.9623782555183102,1.1091717009364783,1.7716435052012987,1.9077254534927746,1.528411842591294,0.95629375884289247,0.378119351709433,2.0152550557562448,1.5830523350164534,1.0273935547043185,1.2956194049669387,1.6813500789311666,1.2081934317177583,1.23059667644676,1.3086447858093888,1.0525418403171982,0.75060341395778429,1.6493957240880974,1.2946345229590666,1.601032443988079,1.5835129192305271,1.8974720122905797,0.97887195946612904,1.45923280029967,0.92641636411884276,{"$f":"'User Add-in Location'!B48","v":0},{"$f":"'User Add-in Location'!C48","v":0},1.1913738445149273,0.91516972053074408,1.7886339450982391,1.4432359047219774,0.95484498726529032,1.1571221535127716,1.3963035016879031,0.85309172196721172,1.606435104797608,1.4023150318049256,1.6836936900694452,1.6342970874045188,1.6002881690764479,1.2051862419369812,1.2181175911098916,1.4426062914582942,1.4478178115286495,3.5459857763072837,1.6304778059322607,1.4425241134780054,1.1930241288097982,1.1656871278633731,0.89499736291435417,1.6643279532110358,0.44892631015635548]
[null,null,"Fabricated Metals",1.6437198425211559,1.3288223521738518,2.4894425200253001,1.500710110293656,2.3662379285911235,2.2368130414951137,1.9218265343366601,1.6197452654198903,0,2.6262772174143212,2.1214620710873024,1.7352446357651454,1.8352835570893637,2.4698655354540522,1.8387563702900236,1.709404988623247,1.6812722036024419,1.8325310970951871,1.5936080081070343,2.1079528150035114,1.8493391842376896,2.1241568843039071,2.4403520059294816,2.6784836671701293,1.5088254569507227,2.2156967259034879,1.8013796119428263,{"$f":"'User Add-in Location'!B49","v":0},{"$f":"'User Add-in Location'!C49","v":0},1.7074631719690998,1.174136369330127,2.130581837601778,2.2007060170900532,1.3105100082551562,1.6196422420623826,2.1131461182745492,1.2958810387588129,2.4273439758434527,1.8502824846200827,2.2360064496354362,2.3392265933315928,2.1248704078720837,1.8966728606965484,1.4337668059075752,2.357901139593706,2.2165510094747312,4.5566277191406348,2.3333239337293112,2.0383851931589407,1.9523266572050932,1.6498401244965997,1.3764705392645626,2.2972185299163912,0.87421384490117793]
[null,null,"Machinery",1.1510360953398049,0.86079482437344268,1.7713277924340218,1.1323204406071454,1.9580052189994603,1.7370202853344381,1.588572934968397,1.4268733921926469,0.40388319076737389,2.0795252397656441,1.5946922866860405,1.1556519271107391,1.2284438111819327,1.7007534668082371,1.3153618652140722,1.1229881477775052,1.2342653373489156,1.3156063003698364,1.1562821659026667,1.8823842243291438,1.208707935642451,1.907682218356058,2.0054597626440227,2.0363881220109761,0.85538759606424719,1.4168194005033001,1.0192193887196481,{"$f":"'User Add-in Location'!B50","v":0},{"$f":"'User Add-in Location'!C50","v":0},1.057085481705144,0.91057922039180994,2.6936294543556869,1.9467080435715616,0.94983363774372265,1.2682646890170872,1.6297761597670615,0.81804646993987262,2.006768059451133,1.4854310487862676,1.7784703826764598,1.8583602876169607,1.8785020462237298,1.5191380300093442,1.0323230165522546,1.5468966248445213,1.7269914799835533,3.8123592538759112,1.6853774973424152,2.02433141018264,1.5078659248538315,1.4073958797380328,1.4252929204376414,1.5412844818783924,0.58963934285566211]
[null,null,"Electrical Equipment",1.756674490949159,0,2.2296862448415449,1.4229424243332238,2.2608492964057514,1.8897166687955138,1.6516310015032369,1.658727256200647,0.24626022352967211,2.2981213138949488,1.7332359475474204,0.89446088191001649,1.7480628926266906,2.2122596181848997,1.7919482518267889,1.5008316232312111,1.5840467458130212,1.7172549104177823,1.4939852235137776,1.5339036974855649,1.597986250795344,1.773177400712044,2.3083224424751858,2.2058128464606499,1.1370414892832439,1.8449779300279514,1.1143464452476912,{"$f":"'User Add-in Location'!B51","v":0},{"$f":"'User Add-in Location'!C51","v":0},1.7993165241774693,1.0332094815469557,2.097090469893589,1.8640676903468307,1.0081573788837721,1.3729519485145487,1.6310075841924196,1.1549539450676212,2.0359084272897374,1.7048232837389874,0.98681542437563663,2.0010987994491414,1.4005609238019554,1.9476670436961676,1.3281408894446589,2.0108321789772279,1.8048358463471936,3.5976256965309061,1.8415630120103077,1.6790485612807735,1.5494022882112892,1.2185199914440032,1.0319777034944104,2.1060712516948743,0.72902288295889417]
[null,null,"TCPU",1.67756099863775,0.84060138116227223,2.2971328782339784,1.775493824961176,2.3315642655256252,2.5533948908154116,1.7296537286825597,1.6247557121763361,0.62921016083116499,2.35161847535591,2.259518119034416,1.4673861294444113,1.9551792695233083,2.5697486747502856,1.9570725320370244,1.7367337177080515,1.7460002802903436,1.7295680887459095,1.5931463100358032,2.0503178920155527,1.6709094388931935,1.9768004835563722,2.2596689647137165,2.4447327350560815,1.5040203917285209,2.1750195124784595,1.9062874756093466,{"$f":"'User Add-in Location'!B52","v":0},{"$f":"'User Add-in Location'!C52","v":0},1.9640761798321245,0,1.9034487298271996,2.043650375231862,1.5048338563278534,1.7490435976101724,2.098604351631987,1.5309601213447734,2.2288989717109651,2.2344325055265206,2.0420934733272404,2.498420480221287,1.9304493028300802,1.6429575278809043,1.6401682603999583,2.3215698782806502,2.5009263093596203,4.1547579280170668,2.6895208329078946,2.0023204958850229,1.905419251962049,1.5933210338743842,1.6203621308687359,2.1530568866872226,0.97912529888037725]
[null,null,"Wholesale Trade",2.0576285079567733,1.2240348267698002,2.9906137443588166,1.7330859661102296,2.3488607138216855,2.9266895171411025,2.072876697243331,2.0119316412303263,0.62792103262004739,3.0513665627576634,2.6361155050243448,2.0063843884153996,2.2548413707824526,2.7575533775512331,2.2406313465027039,2.1345081991778163,2.0752246985178511,1.9185811376857187,1.8198262799999672,2.5610674963739819,2.142257688430969,2.547726942964657,2.6715158876544702,3.0528401797403122,1.7291853236581038,2.6404872217578088,2.144447846041468,{"$f":"'User Add-in Location'!B53","v":0},{"$f":"'User Add-in Location'!C53","v":0},2.1532406184487716,1.4726870152764693,2.8268383522947391,2.3262331796977334,1.6420476368087495,1.8192389214110232,2.7076143855820161,1.5606054243213403,2.7286563176594809,1.9661297501204258,2.6172358878358395,2.632539557839582,2.5359887791250997,2.1119111692120218,1.9438807541738727,2.5426524022382178,2.3714604052240977,4.0664958120106229,2.8186184029379291,2.2871516207734981,2.2566429586467631,1.8363693605639979,1.7123921704149532,2.5584654302654153,1.1013043149502693]
[null,null,"Retail Trade",2.4479159566163111,2.060249313541886,3.5433871682509155,2.4234300153634973,2.8755052180482701,3.3354338780669703,2.7275932514295267,2.5431145826370227,0.69731982128364112,3.8255183186498383,3.249956639777225,2.3745917963418721,2.9015539249934408,3.2624426450969062,2.7183489774077882,2.6139351833166282,2.4065816996211962,2.7609558361500888,2.2569435261990036,3.241743835890829,2.6146030529527744,3.1266786069790098,3.0659790411307806,3.3523583170664919,2.2901173700200448,3.2166128619790348,3.1442221071732837,{"$f":"'User Add-in Location'!B54","v":0},{"$f":"'User Add-in Location'!C54","v":0},2.5808105957208474,1.172302639039527,3.5353496717480604,2.9312426669853657,2.3004298324541383,2.3284268470002965,3.4661144498460454,1.9610687694927253,3.2464137738293939,2.7275652649379012,3.5552666503240928,3.3301477895287821,3.1866321649064751,2.7220893160405271,2.4515047204104072,3.292049890425218,2.8408510007662167,4.9252490743098143,3.4725146246428538,3.0393092579634611,2.6135021763182014,2.1691657982976582,2.2514042158845902,2.9846189515970178,1.4664371956965438]
[null,null,"FIRE",1.8621149505155619,1.1781465771921333,2.7196502391581103,1.509702090149543,2.0670464974722242,2.4412476223502395,2.1965538360396195,1.3050174747322283,0.49829344491000049,2.8160195700674842,2.2239105263019958,1.5429361836624329,1.77054296775583,2.391852889891529,1.7247229934047812,1.7639738374269038,1.8368439153019869,1.8580905014994527,1.5594144523891569,2.0970225518919596,1.7074567978989768,2.4177698861720747,2.2257140714593704,2.8697056060965824,1.5250150332714891,2.1710660384235925,1.6844482202609927,{"$f":"'User Add-in Location'!B55","v":0},{"$f":"'User Add-in Location'!C55","v":0},1.8112528595457165,0,2.2210675689942083,2.0370078278627051,1.1637868649502969,1.8710541227007076,2.5544130794588398,1.3648556239262921,2.1771882101432616,1.8264502491810615,1.9048829466707446,2.3619171368848551,2.2714313568991735,2.1423812230630004,1.5042785901020626,2.3804906237075469,2.387698884355467,3.7305057645802622,2.0964772305118418,1.847419051627486,1.7633199071539609,1.4226672040415509,1.3891182130469477,1.9828035657537955,0.8558435969832876]
[null,null,"Misc. Services",2.9555047099566845,2.2104293572250402,4.1357597444903682,2.5691342375808173,3.5036120439901226,3.9176570032101599,3.0016256139471098,2.6701175890680715,0.86150156681551948,4.3548235404839097,3.7903530398461842,2.7323037864843083,2.9285405679006304,3.8574100842996271,2.6421555718641221,2.7025278457372637,2.8930396701483745,2.8849029746793757,2.7021108232873972,3.5256918933446642,2.9761115350723872,3.2900595223675109,3.8362859113926961,3.8969548173060704,2.4444192885930964,3.5105119451993234,2.9631135079593838,{"$f":"'User Add-in Location'!B56","v":0},{"$f":"'User Add-in Location'!C56","v":0},2.7704021797241505,2.1533214837890733,3.4041130938422741,3.3034716759411453,2.3702774133321487,2.6063696260285747,3.4179681269125179,2.1740253245441545,3.7361070243437013,2.8663107237894918,3.0452903053533502,3.5789764404210658,3.3089337184950773,3.1317999163559009,2.4416852678987082,3.6071730327530647,3.462260420557298,5.6359388469623521,3.775688577784706,3.1120800913716606,3.2622015539196543,2.5384688144258232,2.4165815920698863,3.3035440756720251,1.5988519716904963]
[null,null,"Professional Services",2.3601020912469508,1.7588513226168985,3.4485602078080575,2.0632541366437187,2.891375248080545,3.1283694899205141,2.550723208581994,2.399505293717922,0.79212144723876232,3.6067451166405995,3.0031223897316788,2.4020862708252766,2.5922024094820149,3.1899498603768555,2.6116452147757645,2.3208666894518664,2.3500642322918615,2.4868407029468171,2.1268400067216575,3.1166777244378645,2.5088649358195347,2.9452656176293637,3.1413320358237669,3.3590186138539209,2.039285443052981,2.9887904101245497,2.5181881215604136,{"$f":"'User Add-in Location'!B57","v":0},{"$f":"'User Add-in Location'!C57","v":0},2.5108465604456369,1.6709430261140215,3.0306315649657107,2.8083069312069022,1.9108663470003813,2.2469882187216199,3.0903113956863111,1.7495848962992719,3.2431467288772802,2.3277780501761165,3.0790223518257887,3.2141973958961128,2.9676308575132109,2.472816395451447,2.2776707412342554,3.2309098927427593,2.7756339998717081,4.864449697730147,3.0861472360946558,2.7506220140249913,2.6358267562037003,2.0956817861855703,2.1586338427038534,2.8641638345827833,1.2425691853604237]
[null,null,"Government",3.1878123987686191,2.7832528984868379,4.2843179518423486,3.4685033200693165,3.7169836835214292,4.3067369867988434,2.9042487867899309,2.9235543771697863,0.75406474740204366,4.820780668877755,4.4803295236360761,3.5229228765402807,3.8683865698126438,4.4886655525775137,3.9973313260652303,3.578899055567212,3.6314436438134079,3.6933921950303406,3.3567911175199878,4.5381308047115843,2.9283253734430024,2.8794060562058665,4.4402582612375028,4.2252971435619218,3.4012298590940424,4.2869265512512342,3.7990067615550771,{"$f":"'User Add-in Location'!B58","v":0},{"$f":"'User Add-in Location'!C58","v":0},3.8552538136510757,2.4492931325969516,3.3154741980401727,3.7763216406824291,2.27341512917255,2.8129386321025378,4.5085210671483988,2.648063899651659,4.3361117549398189,3.2409727345584169,4.1528619349568014,4.0872927004190194,3.4364764692138183,3.8876053930459276,3.2626505586720138,4.1155995345306948,3.7686159202080414,5.890527433413471,4.3149006782353663,4.1488155939559883,3.181387042234102,2.8340844838485326,3.0344655294647884,4.0313616004153641,2.1940858219767208]
[]
[null,null,"Earnings Per Million Dollars Change in Final Demand"]
[null,null,"Earnings Direct Multipliers","Alabama","Alaska","Arizona","Arkansas","California","Colorado","Connecticut","Delaware","District of Columbia","Florida","Georgia","Hawaii","Idaho","Illinois","Indiana","Iowa","Kansas","Kentucky","Louisiana","Maine","Maryland","Massachusetts","Michigan","Minnesota","Mississippi","Missouri","Montana","MyCounty","MyRegion","Nebraska","Nevada","New Hampshire","New Jersey","New Mexico","New York","North Carolina","North Dakota","Ohio","Oklahoma","Oregon","Pennsylvania","Rhode Island","South Carolina","South Dakota","Tennessee","Texas","United States","Utah","Vermont","Virginia","Washington","West Virginia","Wisconsin","Wyoming"]
[null,null,"Agriculture",0.31032046675682068,0.45057016611099243,0.27041628956794739,0.26651883125305176,0.43417537212371826,0.20264269411563873,0.26130279898643494,0.1723911315202713,0.19533370435237885,0.38660275936126709,0.40934967994689941,0.47207099199295044,0.36470335721969604,0.50389683246612549,0.38238194584846497,0.2701869010925293,0.24202048778533936,0.30583181977272034,0.42874276638031006,0.3682408332824707,0.24517486989498138,0.40936082601547241,0.28662571310997009,0.24508363008499146,0.36351531744003296,0.26675727963447571,0.2006334513425827,{"$f":"'User Add-in Location'!B62","v":0},{"$f":"'User Add-in Location'!C62","v":0},0.2579934298992157,0.26385286450386047,0.27641800045967102,0.47454649209976196,0.41970589756965637,0.30550473928451538,0.27077579498291016,0.18508340418338776,0.26801368594169617,0.15793138742446899,0.38706052303314209,0.21677544713020325,0.30154457688331604,0.31018808484077454,0.31343108415603638,0.22844129800796509,0.20893400907516479,0.3127923309803009,0.16026535630226135,0.23238518834114075,0.1767638623714447,0.46234482526779175,6.5075986087322235E-2,0.27112287282943726,0.19510716199874878]
[null,null,"Mining",0.13383303582668304,0.15009030699729919,0.14707055687904358,0.20257328450679779,0.19753266870975494,0.33065205812454224,0.20116519927978516,0.39228817820549011,0.14347924292087555,9.5506131649017334E-2,0.22085162997245789,0.14957243204116821,0.1952044665813446,0.14429479837417603,0.2131534218788147,0.16391342878341675,0.2662663459777832,0.14395907521247864,0.23087531328201294,9.4611369073390961E-2,0.12728747725486755,0.25049674510955811,0.20748674869537354,0.18858632445335388,0.2901008129119873,0.1536700427532196,0.2437688410282135,{"$f":"'User Add-in Location'!B63","v":0},{"$f":"'User Add-in Location'!C63","v":0},0.21380917727947235,0.20507539808750153,0.1477106511592865,0.36051160097122192,0.21677447855472565,0.35822781920433044,9.0057864785194397E-2,0.28356510400772095,0.20844560861587524,0.34159326553344727,0.15522894263267517,0.21459084749221802,0.19740894436836243,0.12003126740455627,0.16040363907814026,0.13667060434818268,0.29566863179206848,0.25342559814453125,0.21589186787605286,0.13078249990940094,0.22198532521724701,0.11458542943000793,0.16743282973766327,0.1791878342628479,0.18649187684059143]
[null,null,"Construction",0.29887735843658447,0.38731285929679871,0.27832630276679993,0.25795885920524597,0.31438863277435303,0.30604159832000732,0.35746568441390991,0.31822109222412109,0.3712247908115387,0.2458796352148056,0.26645529270172119,0.33890807628631592,0.25086641311645508,0.31914177536964417,0.30834564566612244,0.31963843107223511,0.30468523502349854,0.27313140034675598,0.33333873748779297,0.25475150346755981,0.36102104187011719,0.34734481573104858,0.28968995809555054,0.29822328686714172,0.26657211780548096,0.30688920617103577,0.26475456357002258,{"$f":"'User Add-in Location'!B64","v":0},{"$f":"'User Add-in Location'!C64","v":0},0.32548287510871887,0.31882080435752869,0.33588981628417969,0.36014914512634277,0.27193677425384521,0.33293142914772034,0.261900395154953,0.37644654512405396,0.30417507886886597,0.31410190463066101,0.31040656566619873,0.33943110704421997,0.29367804527282715,0.2588304877281189,0.28879168629646301,0.33215844631195068,0.33882597088813782,0.31146121025085449,0.30499798059463501,0.28526967763900757,0.29956281185150146,0.33280614018440247,0.31056240200996399,0.30652129650115967,0.3057226836681366]
[null,null,"Manufacturing",0.12141793966293335,0.10937891900539398,0.18053582310676575,0.12119415402412415,0.17018918693065643,0.16759763658046722,0.23083196580410004,0.11795216798782349,0.23142236471176147,0.16458460688591003,0.14315502345561981,9.9472008645534515E-2,0.11277534067630768,0.15231293439865112,0.12832170724868774,0.1415296196937561,0.1311449408531189,0.11370889842510223,6.1380598694086075E-2,0.15788930654525757,0.18075554072856903,0.21350954473018646,0.14570987224578857,0.17007237672805786,0.10618958622217178,0.1353948712348938,6.1702501028776169E-2,{"$f":"'User Add-in Location'!B65","v":0},{"$f":"'User Add-in Location'!C65","v":0},0.12089530378580093,0.18090462684631348,0.21938811242580414,0.16959403455257416,8.9492373168468475E-2,0.17488150298595428,0.12764163315296173,0.10456264764070511,0.13859961926937103,0.13776746392250061,0.16418533027172089,0.15446008741855621,0.19302208721637726,0.13496607542037964,0.14339008927345276,0.13714981079101563,9.8327822983264923E-2,0.14086690545082092,0.13038751482963562,0.15487231314182281,0.14748799800872803,0.15162737667560577,0.11161415278911591,0.16830222308635712,5.2208516746759415E-2]
[null,null,"Fabricated Metals",0.22857089340686798,0.26860252022743225,0.25054216384887695,0.22339411079883575,0.26940628886222839,0.23841705918312073,0.30066516995429993,0.27229538559913635,0,0.24520599842071533,0.23155659437179565,0.24878846108913422,0.22860912978649139,0.28470349311828613,0.23789939284324646,0.24674992263317108,0.23504690825939178,0.26390531659126282,0.26002040505409241,0.23564253747463226,0.2778027355670929,0.3058469295501709,0.2780953049659729,0.29868057370185852,0.23041102290153503,0.26329627633094788,0.24119752645492554,{"$f":"'User Add-in Location'!B66","v":0},{"$f":"'User Add-in Location'!C66","v":0},0.23932714760303497,0.24612338840961456,0.27144956588745117,0.3142554759979248,0.19625486433506012,0.28260201215744019,0.22652335464954376,0.25303912162780762,0.26805374026298523,0.26722967624664307,0.26116475462913513,0.27413663268089294,0.26779976487159729,0.25739759206771851,0.2104467898607254,0.28488034009933472,0.26669672131538391,0.26399978995323181,0.23884277045726776,0.27195316553115845,0.28885412216186523,0.25979405641555786,0.21789389848709106,0.28101184964179993,0.21732021868228912]
[null,null,"Machinery",0.1224844679236412,0.1463325172662735,0.1503881961107254,0.13356387615203857,0.19695518910884857,0.13693612813949585,0.22152166068553925,0.23028689622879028,0.23828785121440887,0.15605390071868896,0.14117145538330078,0.11619918048381805,0.11316985636949539,0.15898142755031586,0.13374185562133789,0.13246311247348785,0.13206146657466888,0.15609352290630341,0.15743634104728699,0.19218486547470093,0.13344083726406097,0.25277942419052124,0.20460909605026245,0.17483216524124146,9.4050146639347076E-2,0.10728654265403748,8.3291441202163696E-2,{"$f":"'User Add-in Location'!B67","v":0},{"$f":"'User Add-in Location'!C67","v":0},0.11121872812509537,0.16919682919979095,0.38091203570365906,0.26239997148513794,0.11636293679475784,0.19314700365066528,0.15694910287857056,0.1144535094499588,0.19367006421089172,0.193722203373909,0.17569735646247864,0.18821409344673157,0.23757345974445343,0.18502353131771088,0.11364121735095978,0.14249758422374725,0.17607462406158447,0.16091690957546234,0.13620190322399139,0.27467292547225952,0.19270995259284973,0.1940343827009201,0.22955283522605896,0.1418120265007019,0.11252248287200928]
[null,null,"Electrical Equipment",0.22420395910739899,0,0.17434805631637573,0.18022027611732483,0.21880748867988586,0.14553667604923248,0.21224196255207062,0.26271429657936096,0.14159795641899109,0.16420318186283112,0.14199367165565491,7.1117490530014038E-2,0.18280212581157684,0.2226409912109375,0.21950729191303253,0.18800307810306549,0.20522738993167877,0.21593540906906128,0.22374297678470612,0.13140697777271271,0.19986888766288757,0.18131053447723389,0.22550582885742188,0.17253698408603668,0.13318224251270294,0.20079287886619568,8.4557108581066132E-2,{"$f":"'User Add-in Location'!B68","v":0},{"$f":"'User Add-in Location'!C68","v":0},0.23483291268348694,0.21154497563838959,0.22557713091373444,0.21263109147548676,0.13398599624633789,0.17705990374088287,0.12872648239135742,0.17491608858108521,0.17991152405738831,0.21250474452972412,9.4808466732501984E-2,0.19842013716697693,0.11130846291780472,0.25532019138336182,0.15517546236515045,0.21109552681446075,0.16998089849948883,0.16918809711933136,0.1307377815246582,0.1557445228099823,0.16821108758449554,0.13916634023189545,0.12027114629745483,0.21979556977748871,0.14448109269142151]
[null,null,"TCPU",0.1874801367521286,0.14063429832458496,0.19784347712993622,0.22897033393383026,0.26693859696388245,0.24854268133640289,0.23382778465747833,0.22597356140613556,0.40799301862716675,0.18348942697048187,0.21699698269367218,0.176984503865242,0.21687650680541992,0.26058167219161987,0.21917217969894409,0.21783080697059631,0.21201843023300171,0.2018236368894577,0.20148399472236633,0.20032788813114166,0.20874010026454926,0.24061532318592072,0.21784885227680206,0.21906717121601105,0.18341492116451263,0.21896794438362122,0.21107512712478638,{"$f":"'User Add-in Location'!B69","v":0},{"$f":"'User Add-in Location'!C69","v":0},0.27945861220359802,0,0.20471429824829102,0.26290154457092285,0.19684125483036041,0.26212731003761292,0.20517422258853912,0.25909033417701721,0.21643264591693878,0.27717852592468262,0.21019773185253143,0.27050328254699707,0.21665641665458679,0.17655658721923828,0.2080770879983902,0.23025767505168915,0.27950417995452881,0.23601624369621277,0.25521314144134521,0.21444277465343475,0.23812630772590637,0.22945369780063629,0.21495343744754791,0.22982357442378998,0.20618286728858948]
[null,null,"Wholesale Trade",0.3224702775478363,0.26406127214431763,0.34569883346557617,0.2906990647315979,0.33129799365997314,0.38002398610115051,0.36164253950119019,0.37827348709106445,0.45635443925857544,0.32845714688301086,0.34146007895469666,0.30526614189147949,0.31574463844299316,0.36682388186454773,0.32941713929176331,0.34679678082466125,0.33372014760971069,0.29570505023002625,0.3241221010684967,0.31389516592025757,0.35238823294639587,0.41025626659393311,0.34875506162643433,0.39022019505500793,0.2890285849571228,0.34349259734153748,0.31589311361312866,{"$f":"'User Add-in Location'!B70","v":0},{"$f":"'User Add-in Location'!C70","v":0},0.32845783233642578,0.33913284540176392,0.40898126363754272,0.37289732694625854,0.27737811207771301,0.35600283741950989,0.34059831500053406,0.34932065010070801,0.33928829431533813,0.30673494935035706,0.34465056657791138,0.35922211408615112,0.35186243057250977,0.30814066529273987,0.32482093572616577,0.3274993896484375,0.35475760698318481,0.34587255120277405,0.3382551372051239,0.31449887156486511,0.3585369884967804,0.33852019906044006,0.30008983612060547,0.34521922469139099,0.31460079550743103]
[null,null,"Retail Trade",0.37944304943084717,0.46526563167572021,0.40752050280570984,0.39769983291625977,0.41805332899093628,0.41608908772468567,0.46118521690368652,0.4470197856426239,0.45631298422813416,0.40913689136505127,0.40394529700279236,0.38391238451004028,0.41140064597129822,0.41250461339950562,0.38771769404411316,0.40387466549873352,0.37072217464447021,0.42007178068161011,0.39543461799621582,0.39584654569625854,0.42065641283988953,0.47962033748626709,0.38560748100280762,0.39991405606269836,0.38243976235389709,0.40752106904983521,0.46421024203300476,{"$f":"'User Add-in Location'!B71","v":0},{"$f":"'User Add-in Location'!C71","v":0},0.37981215119361877,0.23894608020782471,0.49700558185577393,0.45951876044273376,0.40629827976226807,0.44881659746170044,0.42640289664268494,0.41749531030654907,0.3954983651638031,0.43050599098205566,0.4636196494102478,0.43357387185096741,0.4425281286239624,0.39063075184822083,0.40028199553489685,0.42910000681877136,0.40749001502990723,0.41573271155357361,0.42181551456451416,0.4338243305683136,0.39674454927444458,0.40379858016967773,0.39174652099609375,0.38853001594543457,0.39975175261497498]
[null,null,"FIRE",0.2322181910276413,0.22575655579566956,0.23608078062534332,0.19704622030258179,0.24990385770797729,0.22576451301574707,0.32256314158439636,0.21032735705375671,0.30168464779853821,0.21979019045829773,0.22719098627567291,0.20921501517295837,0.17657671868801117,0.25487881898880005,0.20100900530815125,0.23126329481601715,0.22884531319141388,0.23255693912506104,0.21932804584503174,0.2095508873462677,0.22995549440383911,0.33427801728248596,0.2235332727432251,0.29283174872398376,0.20007571578025818,0.22566471993923187,0.19251000881195068,{"$f":"'User Add-in Location'!B72","v":0},{"$f":"'User Add-in Location'!C72","v":0},0.21877670288085938,0,0.25474107265472412,0.25402712821960449,0.15965108573436737,0.35466206073760986,0.29138064384460449,0.2387787252664566,0.22205232083797455,0.21785077452659607,0.19258037209510803,0.2538430392742157,0.2676013708114624,0.25637000799179077,0.21915221214294434,0.25662708282470703,0.25891312956809998,0.25747516751289368,0.18352746963500977,0.21256974339485168,0.22655779123306274,0.20886503159999847,0.20460915565490723,0.20950505137443542,0.17991143465042114]
[null,null,"Misc. Services",0.48457735776901245,0.53140950202941895,0.50042271614074707,0.44019806385040283,0.54672825336456299,0.52916699647903442,0.5375397801399231,0.52072644233703613,0.59385061264038086,0.50060200691223145,0.52079415321350098,0.46675455570220947,0.42362824082374573,0.55443489551544189,0.40206480026245117,0.4488164484500885,0.47570061683654785,0.46718162298202515,0.51445901393890381,0.44743168354034424,0.51174962520599365,0.54390037059783936,0.51481425762176514,0.51240211725234985,0.42664092779159546,0.48356983065605164,0.45594486594200134,{"$f":"'User Add-in Location'!B73","v":0},{"$f":"'User Add-in Location'!C73","v":0},0.44301453232765198,0.52798914909362793,0.49147605895996094,0.55664396286010742,0.42717307806015015,0.55382430553436279,0.44600144028663635,0.50632303953170776,0.48860406875610352,0.47800159454345703,0.422707200050354,0.50964123010635376,0.47090771794319153,0.47564902901649475,0.40908858180046082,0.50465905666351318,0.54846107959747314,0.52073925733566284,0.46831628680229187,0.44835430383682251,0.56426495313644409,0.48456203937530518,0.44500210881233215,0.46265462040901184,0.46769946813583374]
[null,null,"Professional Services",0.34884911775588989,0.37580659985542297,0.36924928426742554,0.3238660991191864,0.39246702194213867,0.37408500909805298,0.41532045602798462,0.42001637816429138,0.51547634601593018,0.36311072111129761,0.34852632880210876,0.3729102611541748,0.34283560514450073,0.39119225740432739,0.36346358060836792,0.34891137480735779,0.34938055276870728,0.3651278018951416,0.35610795021057129,0.36709079146385193,0.38978970050811768,0.44276914000511169,0.37963777780532837,0.39642995595932007,0.31934157013893127,0.36273297667503357,0.34770816564559937,{"$f":"'User Add-in Location'!B74","v":0},{"$f":"'User Add-in Location'!C74","v":0},0.36375501751899719,0.37149909138679504,0.40884390473365784,0.42154374718666077,0.30356350541114807,0.41591024398803711,0.36339178681373596,0.36247563362121582,0.38620597124099731,0.34286326169967651,0.38614818453788757,0.42016333341598511,0.3947855532169342,0.33197855949401855,0.35905203223228455,0.40854665637016296,0.37428101897239685,0.38455450534820557,0.34547340869903564,0.36940035223960876,0.39925998449325562,0.35994070768356323,0.36661419272422791,0.36908605694770813,0.32473477721214294]
[null,null,"Government",0.65951740741729736,0.84008699655532837,0.66445237398147583,0.76184660196304321,0.74246829748153687,0.77465736865997314,0.6432267427444458,0.73890697956085205,0.74078977108001709,0.73332470655441284,0.80894267559051514,0.77255445718765259,0.73272198438644409,0.83481884002685547,0.79214948415756226,0.76589369773864746,0.77444332838058472,0.76782339811325073,0.76607662439346313,0.77143138647079468,0.66403418779373169,0.64978581666946411,0.78698962926864624,0.72022783756256104,0.75427591800689697,0.77256596088409424,0.74814766645431519,{"$f":"'User Add-in Location'!B75","v":0},{"$f":"'User Add-in Location'!C75","v":0},0.80871880054473877,0.69892603158950806,0.63836967945098877,0.82544100284576416,0.51014268398284912,0.7576025128364563,0.80182784795761108,0.71987134218215942,0.75696814060211182,0.64443153142929077,0.74260950088500977,0.76290231943130493,0.67770671844482422,0.75965934991836548,0.68482935428619385,0.72967088222503662,0.75318366289138794,0.73905831575393677,0.7371143102645874,0.8133816123008728,0.6822015643119812,0.67520207166671753,0.69752919673919678,0.7372550368309021,0.76997506618499756]
[]
[null,null,"Earnings Per Million Dollars Change in Final Demand"]
[null,null,"  Earnings Indirect Multipliers","Alabama","Alaska","Arizona","Arkansas","California","Colorado","Connecticut","Delaware","District of Columbia","Florida","Georgia","Hawaii","Idaho","Illinois","Indiana","Iowa","Kansas","Kentucky","Louisiana","Maine","Maryland","Massachusetts","Michigan","Minnesota","Mississippi","Missouri","Montana","MyCounty","MyRegion","Nebraska","Nevada","New Hampshire","New Jersey","New Mexico","New York","North Carolina","North Dakota","Ohio","Oklahoma","Oregon","Pennsylvania","Rhode Island","South Carolina","South Dakota","Tennessee","Texas","United States","Utah","Vermont","Virginia","Washington","West Virginia","Wisconsin","Wyoming"]
[null,null,"Agriculture",7.1475125849246979E-2,2.9256105422973633E-2,5.9685982763767242E-2,0.10290594398975372,5.9046462178230286E-2,0.10989853739738464,3.6577768623828888E-2,7.3237016797065735E-2,5.4880071431398392E-2,4.7513276338577271E-2,9.3869201838970184E-2,4.5586034655570984E-2,0.1140865758061409,0.10706116259098053,6.0020998120307922E-2,9.551490843296051E-2,0.11804729700088501,5.2609808743000031E-2,4.3605498969554901E-2,5.9952333569526672E-2,5.4205253720283508E-2,3.4785941243171692E-2,5.7785026729106903E-2,0.10003787279129028,7.790866494178772E-2,7.1644321084022522E-2,7.9692885279655457E-2,{"$f":"'User Add-in Location'!B79","v":8.7303593754768372E-2},{"$f":"'User Add-in Location'!C79","v":0},0.12404529750347137,3.0273757874965668E-2,4.6808250248432159E-2,3.1531915068626404E-2,8.3876818418502808E-2,6.7235067486763E-2,6.481584906578064E-2,7.9523906111717224E-2,6.2163323163986206E-2,6.3348725438117981E-2,7.3605090379714966E-2,6.5034136176109314E-2,3.133026510477066E-2,4.7288194298744202E-2,0.12592822313308716,5.4912187159061432E-2,8.2019716501235962E-2,0.16572409868240356,5.6010287255048752E-2,7.7543504536151886E-2,5.3974252194166183E-2,5.7410672307014465E-2,3.1250335276126862E-2,0.10315808653831482,4.2834348976612091E-2]
[null,null,"Mining",6.8435132503509521E-2,2.8919186443090439E-2,9.4760596752166748E-2,7.5667232275009155E-2,7.5320951640605927E-2,0.10453084111213684,0.11509822309017181,9.8009772598743439E-2,0.11222494393587112,0.13341248035430908,8.9229747653007507E-2,9.0254127979278564E-2,8.3986923098564148E-2,0.11576959490776062,8.6441926658153534E-2,7.9151064157485962E-2,0.15168082714080811,7.8394785523414612E-2,6.3943371176719666E-2,0.12410250306129456,0.13044579327106476,0.15937015414237976,0.12461639195680618,9.5216765999794006E-2,7.7338047325611115E-2,9.7779318690299988E-2,9.7569778561592102E-2,{"$f":"'User Add-in Location'!B80","v":4.3994605541229248E-2},{"$f":"'User Add-in Location'!C80","v":0},8.7245747447013855E-2,6.0665234923362732E-2,0.10547582805156708,0.13210685551166534,8.1110775470733643E-2,0.14236852526664734,8.2671821117401123E-2,7.0508770644664764E-2,0.1106661856174469,0.13182620704174042,0.11433820426464081,9.0128049254417419E-2,0.11111602932214737,8.1748455762863159E-2,9.1595686972141266E-2,9.3861103057861328E-2,9.1027304530143738E-2,0.14197559654712677,9.3604668974876404E-2,7.1563765406608582E-2,0.1000417172908783,0.1070806011557579,8.5700333118438721E-2,7.3906496167182922E-2,5.7955686002969742E-2]
[null,null,"Construction",0.12155184149742126,9.3869648873806E-2,0.13714815676212311,0.12220568954944611,0.17574077844619751,0.16414204239845276,0.15497986972332001,0.13608837127685547,8.731483668088913E-2,0.15383884310722351,0.15120598673820496,9.7113050520420074E-2,0.13584995269775391,0.14951097965240479,0.12412342429161072,0.11916922777891159,0.13089054822921753,0.11853006482124329,0.10615894198417664,0.14712733030319214,0.12162084877490997,0.16212105751037598,0.14914636313915253,0.15415588021278381,0.10449788719415665,0.14591744542121887,0.12755966186523438,{"$f":"'User Add-in Location'!B81","v":7.391008734703064E-2},{"$f":"'User Add-in Location'!C81","v":0},0.12196582555770874,5.4499223828315735E-2,0.17345553636550903,0.14860253036022186,0.10702479630708694,0.13915446400642395,0.15317812561988831,0.11687559634447098,0.15512549877166748,0.1412825882434845,0.13977663218975067,0.16091740131378174,0.12556728720664978,0.12206400185823441,0.12745127081871033,0.15787053108215332,0.1588500440120697,0.25871437788009644,0.14666247367858887,0.13884064555168152,0.13415935635566711,0.13278046250343323,9.1787509620189667E-2,0.14014655351638794,7.9310253262519836E-2]
[null,null,"Manufacturing",8.8650085031986237E-2,9.4196833670139313E-2,0.10553905367851257,9.8887175321578979E-2,0.15556126832962036,0.14359860122203827,9.5079600811004639E-2,9.3742504715919495E-2,6.1569318175315857E-2,0.114292211830616,0.10924142599105835,0.10245998203754425,0.11180654168128967,0.12775731086730957,8.6024090647697449E-2,9.7358763217926025E-2,0.12365885078907013,8.3864584565162659E-2,9.6944011747837067E-2,9.6773058176040649E-2,7.9777412116527557E-2,0.10921596735715866,0.10713927447795868,0.1340128630399704,8.8676288723945618E-2,0.10335975140333176,0.10407392680644989,{"$f":"'User Add-in Location'!B82","v":5.0878465175628662E-2},{"$f":"'User Add-in Location'!C82","v":0},0.10640329867601395,6.3594870269298553E-2,9.2588678002357483E-2,0.11363387107849121,0.10967233031988144,0.11077801883220673,9.4135850667953491E-2,0.118796207010746,0.11425000429153442,0.13345849514007568,0.11126573383808136,0.12469983845949173,8.9070901274681091E-2,7.8198768198490143E-2,0.10316871851682663,9.974256157875061E-2,0.16708973050117493,0.27259361743927002,0.12053241580724716,9.6678897738456726E-2,8.456120640039444E-2,0.1100388765335083,7.491651177406311E-2,0.11115989834070206,9.0059615671634674E-2]
[null,null,"Fabricated Metals",7.7903188765048981E-2,7.9276613891124725E-2,0.10682260990142822,6.9658324122428894E-2,0.15849040448665619,0.12005691230297089,0.10252566635608673,8.2358211278915405E-2,0,0.11235198378562927,0.1009477898478508,8.67934450507164E-2,8.4558106958866119E-2,0.11974798142910004,8.3313815295696259E-2,7.9005330801010132E-2,8.5858084261417389E-2,7.4793800711631775E-2,6.9478981196880341E-2,8.4860518574714661E-2,8.8795319199562073E-2,0.1158885657787323,0.10559935867786407,0.1238543689250946,6.537078320980072E-2,9.3535766005516052E-2,7.6311282813549042E-2,{"$f":"'User Add-in Location'!B83","v":4.215984046459198E-2},{"$f":"'User Add-in Location'!C83","v":0},7.9512029886245728E-2,6.2572486698627472E-2,9.447769820690155E-2,0.11068589240312576,7.265743613243103E-2,0.11207485198974609,0.1037939190864563,8.1302300095558167E-2,0.10805267095565796,8.3406761288642883E-2,9.915720671415329E-2,0.11902008205652237,0.10118520259857178,7.2985053062438965E-2,7.4248418211936951E-2,9.6330761909484863E-2,0.13167208433151245,0.25825643539428711,0.11451167613267899,7.809671014547348E-2,8.4882661700248718E-2,0.1046898141503334,6.4693666994571686E-2,9.8614536225795746E-2,5.51154725253582E-2]
[null,null,"Machinery",9.1563522815704346E-2,7.9801343381404877E-2,0.10321354120969772,8.6965121328830719E-2,0.15607982873916626,0.14072944223880768,0.11067423969507217,8.1310831010341644E-2,9.6530504524707794E-2,0.12643055617809296,0.10826064646244049,0.10664207488298416,9.5895290374755859E-2,0.11868971586227417,9.5345579087734222E-2,8.0984979867935181E-2,0.10293855518102646,8.6717233061790466E-2,8.1272155046463013E-2,9.3245342373847961E-2,0.10539355874061584,0.12495527416467667,0.10982595384120941,0.14555691182613373,7.3171183466911316E-2,0.12028893083333969,9.5842510461807251E-2,{"$f":"'User Add-in Location'!B84","v":8.1251397728919983E-2},{"$f":"'User Add-in Location'!C84","v":0},8.5779234766960144E-2,6.9658964872360229E-2,8.0226629972457886E-2,0.11237877607345581,7.7934913337230682E-2,0.11515666544437408,9.7123026847839355E-2,9.5949538052082062E-2,0.116291344165802,8.697684109210968E-2,0.11011114716529846,0.12323678284883499,8.7618239223957062E-2,7.8876607120037079E-2,9.1022670269012451E-2,0.10688409954309464,0.13355334103107452,0.27491024136543274,0.11835538595914841,7.188965380191803E-2,9.5186337828636169E-2,0.11607250571250916,6.2296554446220398E-2,0.11218935996294022,7.0825651288032532E-2]
[null,null,"Electrical Equipment",0.10079137980937958,0,0.14319026470184326,9.5496527850627899E-2,0.18668937683105469,0.15501230955123901,0.13150760531425476,9.7824215888977051E-2,6.0731519013643265E-2,0.14623446762561798,0.12767399847507477,0.10051543265581131,0.1131548210978508,0.13667087256908417,9.1000139713287354E-2,9.5797903835773468E-2,9.469711035490036E-2,9.9468186497688293E-2,8.2757167518138885E-2,9.999578446149826E-2,0.11426862329244614,0.16792561113834381,0.13457515835762024,0.17274360358715057,8.7973669171333313E-2,9.402158111333847E-2,0.11030490696430206,{"$f":"'User Add-in Location'!B85","v":0},{"$f":"'User Add-in Location'!C85","v":0},9.863927960395813E-2,5.8487296104431152E-2,0.13179592788219452,0.14450488984584808,7.1172356605529785E-2,0.15476050972938538,0.12427230179309845,0.12072880566120148,0.13298231363296509,0.10800883173942566,6.2976017594337463E-2,0.13528718054294586,0.12992596626281738,8.132423460483551E-2,0.10659033805131912,0.1113918125629425,0.15188482403755188,0.23988394439220428,0.1460379958152771,0.13028723001480103,0.12617930769920349,0.12800335884094238,8.9926429092884064E-2,0.12549513578414917,8.0993145704269409E-2]
[null,null,"TCPU",0.12827518582344055,8.2434341311454773E-2,0.13471275568008423,0.12086257338523865,0.16031894087791443,0.16642020642757416,0.13360138237476349,0.12985116243362427,0.11569172143936157,0.13988804817199707,0.14058580994606018,0.10918384790420532,0.11965075880289078,0.16447374224662781,0.12558209896087646,0.11648903787136078,0.12519086897373199,0.12026705592870712,0.13244558870792389,0.11396555602550507,0.12549519538879395,0.15439207851886749,0.14049398899078369,0.1698901355266571,0.11384116113185883,0.13443396985530853,0.12761697173118591,{"$f":"'User Add-in Location'!B86","v":7.9643756151199341E-2},{"$f":"'User Add-in Location'!C86","v":0},9.2955082654953003E-2,0,0.12560957670211792,0.13591885566711426,0.11467255651950836,0.16554474830627441,0.12600119411945343,0.13878814876079559,0.13224172592163086,0.15369461476802826,0.12136144936084747,0.15405112504959106,0.12133406102657318,0.111933633685112,0.12163866311311722,0.1485515832901001,0.17746029794216156,0.24537524580955505,0.15591536462306976,0.13232314586639404,0.13013797998428345,0.12593762576580048,0.12033390253782272,0.12930016219615936,0.1020248606801033]
[null,null,"Wholesale Trade",0.11166476458311081,0.10028589516878128,0.1399729996919632,9.2180497944355011E-2,0.14982107281684875,0.15098834037780762,0.13124832510948181,0.11739148199558258,0.12332293391227722,0.14211134612560272,0.1264350563287735,0.13368478417396545,0.11949293315410614,0.14436843991279602,0.11323650181293488,0.11388175189495087,0.1148410364985466,0.1054169237613678,0.10283297300338745,0.12648563086986542,0.12776303291320801,0.16123943030834198,0.12642979621887207,0.15456253290176392,9.4344809651374817E-2,0.13762500882148743,0.11149919033050537,{"$f":"'User Add-in Location'!B87","v":4.4560521841049194E-2},{"$f":"'User Add-in Location'!C87","v":0},0.12715846300125122,9.9406741559505463E-2,0.14050388336181641,0.13565295934677124,0.1036418229341507,0.14366075396537781,0.13833326101303101,0.10558784008026123,0.13905173540115356,0.11534467339515686,0.13215044140815735,0.14153480529785156,0.14614541828632355,0.10789800435304642,0.11268718540668488,0.13767923414707184,0.12818044424057007,0.18162813782691956,0.14496718347072601,0.12965719401836395,0.13037389516830444,0.12081979215145111,9.7458697855472565E-2,0.133180171251297,7.397635281085968E-2]
[null,null,"Retail Trade",9.3119144439697266E-2,9.5111101865768433E-2,0.1189127117395401,9.2304140329360962E-2,0.12177841365337372,0.13820217549800873,0.13346719741821289,0.12489917874336243,0.12007161974906921,0.13023604452610016,0.12387368828058243,9.1361813247203827E-2,0.1008361428976059,0.14068745076656342,0.10353030264377594,0.11211446672677994,0.10555128753185272,0.10707594454288483,8.9543245732784271E-2,0.11388467252254486,0.11576870083808899,0.16142274439334869,0.11310205608606339,0.14721772074699402,8.1887990236282349E-2,0.1285540908575058,0.1087879091501236,{"$f":"'User Add-in Location'!B88","v":4.4064939022064209E-2},{"$f":"'User Add-in Location'!C88","v":0},0.11985912919044495,8.0730073153972626E-2,0.13268056511878967,0.12726649641990662,8.2080818712711334E-2,0.1357397735118866,0.13467055559158325,0.10515595972537994,0.1253974437713623,0.10646405071020126,0.1285955011844635,0.14656990766525269,0.12989789247512817,9.975026547908783E-2,0.10470087081193924,0.12239081412553787,0.12232407927513123,0.1690814346075058,0.12325340509414673,0.10607906430959702,0.12129335105419159,9.2421069741249084E-2,8.6135149002075195E-2,0.12198145687580109,7.3654584586620331E-2]
[null,null,"FIRE",0.1212228536605835,8.7370581924915314E-2,0.16134850680828094,0.1030617356300354,0.13312092423439026,0.17303526401519775,0.14823374152183533,7.8486517071723938E-2,9.4597257673740387E-2,0.17084799706935883,0.12836536765098572,9.5793403685092926E-2,0.13083672523498535,0.14385113120079041,0.10545159876346588,0.11123842000961304,0.12853929400444031,0.11624178290367126,0.11114140599966049,0.11467360705137253,0.1146174743771553,0.15253040194511414,0.13255152106285095,0.16770584881305695,0.10396099090576172,0.13008168339729309,0.10930600017309189,{"$f":"'User Add-in Location'!B89","v":6.0611814260482788E-2},{"$f":"'User Add-in Location'!C89","v":0},0.12629730999469757,0,0.13429024815559387,0.14660905301570892,8.3259120583534241E-2,0.10734497010707855,0.11650374531745911,0.11834735423326492,0.12204188108444214,0.13605980575084686,0.1194038987159729,0.15069004893302917,0.13361991941928864,0.12318538874387741,8.6799673736095428E-2,0.13582116365432739,0.17883886396884918,0.1784515380859375,0.14015594124794006,0.11031421273946762,0.11745287477970123,0.11155520379543304,8.5201986134052277E-2,0.12391854822635651,9.2471078038215637E-2]
[null,null,"Misc. Services",0.13294753432273865,0.11684668064117432,0.16460400819778442,0.12205473333597183,0.16490788757801056,0.17533794045448303,0.17225322127342224,0.13065977394580841,0.10560835897922516,0.16435229778289795,0.14623983204364777,0.12569120526313782,0.13589277863502502,0.15474283695220947,0.11497385799884796,0.12907625734806061,0.14362156391143799,0.12865158915519714,0.11516796797513962,0.15263557434082031,0.14916887879371643,0.18570937216281891,0.16055971384048462,0.17605225741863251,0.10979850590229034,0.14981094002723694,0.12853869795799255,{"$f":"'User Add-in Location'!B90","v":7.365792989730835E-2},{"$f":"'User Add-in Location'!C90","v":0},0.13792066276073456,0.10840293020009995,0.16480706632137299,0.15885010361671448,0.11719346046447754,0.15187200903892517,0.1527077853679657,0.12100984156131744,0.16075560450553894,0.13161039352416992,0.12627805769443512,0.16527003049850464,0.17271314561367035,0.13503038883209229,0.135196253657341,0.14964015781879425,0.15060654282569885,0.20391257107257843,0.17252928018569946,0.15011647343635559,0.13599684834480286,0.14473418891429901,0.11006361991167068,0.14908924698829651,9.1100290417671204E-2]
[null,null,"Professional Services",0.104117751121521,9.8827287554740906E-2,0.13996531069278717,9.0614117681980133E-2,0.14683559536933899,0.14268884062767029,0.13705037534236908,0.11443687975406647,0.11486014723777771,0.14281739294528961,0.13639524579048157,0.10503537207841873,0.11203065514564514,0.14681880176067352,0.10567130893468857,0.10642609000205994,0.11278153955936432,0.10687348246574402,9.8583467304706573E-2,0.12001891434192657,0.12207952886819839,0.15742072463035583,0.12826637923717499,0.14842784404754639,9.162449836730957E-2,0.13235506415367126,0.10844896733760834,{"$f":"'User Add-in Location'!B91","v":5.7048916816711426E-2},{"$f":"'User Add-in Location'!C91","v":0},0.11947659403085709,8.12673419713974E-2,0.12736451625823975,0.13701529800891876,9.9753141403198242E-2,0.14418499171733856,0.13375160098075867,0.10097779333591461,0.13090091943740845,0.112030029296875,0.12364454567432404,0.13658267259597778,0.13505890965461731,0.11080875247716904,0.10714558511972427,0.12989471852779388,0.14027239382266998,0.18960437178611755,0.13569225370883942,0.11627743393182755,0.12026838958263397,0.11677148938179016,8.8794678449630737E-2,0.11776135861873627,7.4153073132038116E-2]
[null,null,"Government",3.0096344649791718E-2,1.3247617520391941E-2,4.9050662666559219E-2,2.4140562862157822E-2,3.6047250032424927E-2,2.4891838431358337E-2,6.2673158943653107E-2,6.703048013150692E-3,3.579186275601387E-3,2.7407893911004066E-2,5.3729335777461529E-3,1.7382422462105751E-2,3.3285051584243774E-2,1.6908090561628342E-2,1.7933908849954605E-2,2.5150233879685402E-2,2.9020193964242935E-2,2.6450889185070992E-2,3.8226228207349777E-2,2.9472479596734047E-2,8.7959356606006622E-3,1.4215687289834023E-2,2.3091617971658707E-2,5.3328033536672592E-2,1.9650779664516449E-2,2.8532272204756737E-2,2.9148992151021957E-2,{"$f":"'User Add-in Location'!B92","v":1.8258035182952881E-2},{"$f":"'User Add-in Location'!C92","v":0},2.6093777269124985E-2,4.8106711357831955E-2,2.1946821361780167E-2,1.9946228712797165E-2,3.084859810769558E-2,4.0065314620733261E-2,1.5712590888142586E-2,7.3388442397117615E-2,2.1912354975938797E-2,6.7427642643451691E-2,3.4338794648647308E-2,3.3518053591251373E-2,1.4442667365074158E-2,2.6376184076070786E-2,6.6480755805969238E-2,4.1728653013706207E-2,3.0939433723688126E-2,4.2973577976226807E-2,2.0629595965147018E-2,1.3139591552317142E-2,2.4390570819377899E-2,5.1088262349367142E-2,2.5697717443108559E-2,3.5628277808427811E-2,2.3165300488471985E-2]
[]
[null,null,"Earnings Per Million Dollars Change in Final Demand"]
[null,null,"  Earnings Induced Multipliers","Alabama","Alaska","Arizona","Arkansas","California","Colorado","Connecticut","Delaware","District of Columbia","Florida","Georgia","Hawaii","Idaho","Illinois","Indiana","Iowa","Kansas","Kentucky","Louisiana","Maine","Maryland","Massachusetts","Michigan","Minnesota","Mississippi","Missouri","Montana","MyCounty","MyRegion","Nebraska","Nevada","New Hampshire","New Jersey","New Mexico","New York","North Carolina","North Dakota","Ohio","Oklahoma","Oregon","Pennsylvania","Rhode Island","South Carolina","South Dakota","Tennessee","Texas","United States","Utah","Vermont","Virginia","Washington","West Virginia","Wisconsin","Wyoming"]
[null,null,"Agriculture",8.3892978727817535E-2,9.62686687707901E-2,0.10661719739437103,7.6751045882701874E-2,0.15616044402122498,9.8296791315078735E-2,9.0038023889064789E-2,6.4138822257518768E-2,4.4611047953367233E-2,0.13741646707057953,0.14855280518531799,0.12125083059072495,0.10600273311138153,0.1958870142698288,0.10601475089788437,7.924063503742218E-2,8.1539712846279144E-2,8.3630830049514771E-2,9.5777988433837891E-2,0.11782822012901306,8.0300197005271912E-2,0.14542645215988159,0.10039496421813965,0.11544457823038101,8.2040153443813324E-2,9.7378179430961609E-2,6.0367252677679062E-2,{"$f":"'User Add-in Location'!B96","v":0},{"$f":"'User Add-in Location'!C96","v":0},8.811042457818985E-2,5.1456384360790253E-2,9.9828854203224182E-2,0.15892493724822998,9.3780331313610077E-2,0.10416501015424728,9.8764501512050629E-2,4.8734560608863831E-2,0.10106243938207626,4.974750429391861E-2,0.13022449612617493,9.0720333158969879E-2,0.10118097811937332,8.2979187369346619E-2,9.2940472066402435E-2,8.5900619626045227E-2,8.1432349979877472E-2,0.22233742475509644,6.1473764479160309E-2,7.6689191162586212E-2,6.3676603138446808E-2,0.13360850512981415,1.9523279741406441E-2,0.10209265351295471,2.9974052682518959E-2]
[null,null,"Mining",4.4755861163139343E-2,3.50041463971138E-2,7.8195624053478241E-2,5.7996105402708054E-2,8.6955055594444275E-2,0.13710924983024597,9.3757420778274536E-2,0.1298501193523407,4.0428776293992996E-2,7.2773553431034088E-2,9.2639632523059845E-2,5.6360609829425812E-2,6.1931557953357697E-2,8.5046350955963135E-2,7.2052724659442902E-2,5.3391110152006149E-2,9.5279909670352936E-2,5.1262006163597107E-2,6.1023060232400894E-2,6.022363156080246E-2,6.9353707134723663E-2,0.1349848210811615,9.6948757767677307E-2,9.5228970050811768E-2,6.8318605422973633E-2,7.2678081691265106E-2,7.3473773896694183E-2,{"$f":"'User Add-in Location'!B97","v":0},{"$f":"'User Add-in Location'!C97","v":0},7.0147149264812469E-2,4.6980421990156174E-2,7.8375205397605896E-2,0.15368044376373291,5.5886808782815933E-2,0.14013269543647766,5.1182683557271957E-2,6.4697407186031342E-2,9.8188869655132294E-2,0.1065194308757782,7.6259300112724304E-2,9.8497442901134491E-2,9.3752816319465637E-2,4.6873390674591064E-2,5.4051369428634644E-2,7.03272745013237E-2,0.10852031409740448,0.18488441407680511,8.8139727711677551E-2,5.0224408507347107E-2,8.8652357459068298E-2,5.7268839329481125E-2,5.1350880414247513E-2,6.9416292011737823E-2,3.09439767152071E-2]
[null,null,"Construction",9.2784799635410309E-2,9.4850577414035797E-2,0.13427571952342987,7.9268254339694977E-2,0.15672792494297028,0.14918476343154907,0.15283538401126862,0.11497493088245392,5.0399500876665115E-2,0.12760995328426361,0.12497276067733765,0.10240647941827774,8.5760995745658875E-2,0.15348105132579803,0.10415621101856232,9.6112310886383057E-2,0.1001310721039772,9.0441331267356873E-2,9.109111875295639E-2,0.11062056571245193,0.12998422980308533,0.16709764301776886,0.1282079815864563,0.15181812644004822,6.9012656807899475E-2,0.13086193799972534,8.4445223212242126E-2,{"$f":"'User Add-in Location'!B98","v":0},{"$f":"'User Add-in Location'!C98","v":0},0.10472764074802399,6.5849654376506805E-2,0.15697520971298218,0.15978263318538666,7.1062296628952026E-2,0.12997220456600189,0.12290008366107941,9.0279094874858856E-2,0.14173625409603119,0.10291878879070282,0.12726591527462006,0.16182556748390198,0.12724226713180542,8.8463254272937775E-2,8.9289940893650055E-2,0.14908179640769958,0.14039786159992218,0.26753887534141541,0.12846337258815765,0.1050744503736496,0.11982244998216629,0.12019139528274536,8.1623777747154236E-2,0.12245377153158188,4.8742812126874924E-2]
[null,null,"Manufacturing",4.6516589820384979E-2,3.9900500327348709E-2,9.2621862888336182E-2,4.6010673046112061E-2,0.10477171093225479,9.9144786596298218E-2,9.8769955337047577E-2,5.3028371185064316E-2,3.0698131769895554E-2,8.9334174990653992E-2,7.588813453912735E-2,4.7534074634313583E-2,4.9845762550830841E-2,9.2129886150360107E-2,5.1708217710256577E-2,5.2446924149990082E-2,5.8692503720521927E-2,4.5409068465232849E-2,3.2981563359498978E-2,7.0134282112121582E-2,7.046934962272644E-2,0.10544927418231964,7.3988087475299835E-2,0.1021595373749733,3.626222163438797E-2,6.9123134016990662E-2,3.5684484988451004E-2,{"$f":"'User Add-in Location'!B99","v":0},{"$f":"'User Add-in Location'!C99","v":0},5.3451154381036758E-2,4.3343976140022278E-2,9.70463827252388E-2,8.948969841003418E-2,3.7393219769001007E-2,7.8088678419589996E-2,6.587519496679306E-2,4.0829084813594818E-2,7.8357353806495667E-2,6.1624087393283844E-2,7.7829182147979736E-2,9.0799681842327118E-2,8.5836246609687805E-2,4.953736811876297E-2,5.3062833845615387E-2,7.2507306933403015E-2,7.5242385268211365E-2,0.19469669461250305,7.1650281548500061E-2,6.2456518411636353E-2,6.4361624419689178E-2,6.7825600504875183E-2,3.7841841578483582E-2,7.6781377196311951E-2,1.804468035697937E-2]
[null,null,"Fabricated Metals",6.7896567285060883E-2,6.8550817668437958E-2,0.11569300293922424,6.1295654624700546E-2,0.13778650760650635,0.11446092277765274,0.1222875714302063,8.8442690670490265E-2,0,0.11463059484958649,0.10013797879219055,7.905106246471405E-2,6.9521725177764893E-2,0.13326191902160645,7.7486306428909302E-2,7.1745075285434723E-2,7.4250966310501099E-2,7.7844396233558655E-2,6.8947523832321167E-2,8.8256746530532837E-2,9.9115386605262756E-2,0.13775575160980225,0.11227146536111832,0.14200146496295929,5.5036850273609161E-2,0.10334532707929611,6.8319648504257202E-2,{"$f":"'User Add-in Location'!B100","v":0},{"$f":"'User Add-in Location'!C100","v":0},7.5437605381011963E-2,5.4753676056861877E-2,0.1138233095407486,0.13436232507228851,5.0532840192317963E-2,0.10763059556484222,9.8167389631271362E-2,6.1068836599588394E-2,0.11658091098070145,8.0060377717018127E-2,0.10177133232355118,0.12797001004219055,0.11221928894519806,7.6763391494750977E-2,6.1503779143095016E-2,0.11669067293405533,0.11342543363571167,0.24635151028633118,0.10096005350351334,8.6899161338806152E-2,0.10370751470327377,9.4521112740039825E-2,5.7305384427309036E-2,0.10435286909341812,3.4598171710968018E-2]
[null,null,"Machinery",4.7418523579835892E-2,4.4291868805885315E-2,8.2100264728069305E-2,4.6125687658786774E-2,0.11371129751205444,8.8648810982704163E-2,0.1008140817284584,7.7703632414340973E-2,3.2205134630203247E-2,9.0524405241012573E-2,7.5071796774864197E-2,5.2506759762763977E-2,4.6410400420427322E-2,9.1520197689533234E-2,5.5282894521951675E-2,4.7006674110889435E-2,5.4363980889320374E-2,5.5737897753715515E-2,4.9893148243427277E-2,7.8602440655231476E-2,6.4608655869960785E-2,0.12338709831237793,9.2017874121665955E-2,0.1076713502407074,3.1118249520659447E-2,6.5907254815101624E-2,3.8552518934011459E-2,{"$f":"'User Add-in Location'!B101","v":0},{"$f":"'User Add-in Location'!C101","v":0},4.6577975153923035E-2,4.2350370436906815E-2,0.1435210257768631,0.11853820085525513,3.6527581512928009E-2,8.4056459367275238E-2,7.5510188937187195E-2,3.8447603583335876E-2,9.6125535666942596E-2,6.4102143049240112E-2,8.0730848014354706E-2,0.10139284282922745,9.8947018384933472E-2,6.1319403350353241E-2,4.4163614511489868E-2,7.6350666582584381E-2,8.8137894868850708E-2,0.20556285977363586,7.2729811072349548E-2,8.6070813238620758E-2,7.9884029924869537E-2,8.0416180193424225E-2,5.9179950505495071E-2,6.9827280938625336E-2,2.3273779079318047E-2]
[null,null,"Electrical Equipment",7.200930267572403E-2,0,0.10283124446868896,5.7676307857036591E-2,0.13064694404602051,9.5962464809417725E-2,0.10429424792528152,8.9881390333175659E-2,1.9538760185241699E-2,9.9542848765850067E-2,8.1188693642616272E-2,4.0437594056129456E-2,6.5712854266166687E-2,0.11845402419567108,7.4939228594303131E-2,6.2510795891284943E-2,6.9424204528331757E-2,7.2393126785755157E-2,6.4144663512706757E-2,6.3732437789440155E-2,8.4992431104183197E-2,0.11411610990762711,0.10538811236619949,0.11605006456375122,4.1159048676490784E-2,8.5398361086845398E-2,4.1941165924072266E-2,{"$f":"'User Add-in Location'!B102","v":0},{"$f":"'User Add-in Location'!C102","v":0},7.8889533877372742E-2,4.7816663980484009E-2,0.11118020117282867,0.11294171959161758,3.8577862083911896E-2,9.0540610253810883E-2,7.5191020965576172E-2,5.401262640953064E-2,9.7036577761173248E-2,7.3204226791858673E-2,4.4572331011295319E-2,0.10863802582025528,7.3404543101787567E-2,7.8226484358310699E-2,5.6537963449954987E-2,9.8756425082683563E-2,9.1653198003768921E-2,0.19302189350128174,7.9075001180171967E-2,7.1034952998161316E-2,8.1676334142684937E-2,6.9278158247470856E-2,4.2635954916477203E-2,9.4941072165966034E-2,2.8632242232561111E-2]
[null,null,"TCPU",6.9870226085186005E-2,4.3729815632104874E-2,0.10764679312705994,7.3124341666698456E-2,0.1368924081325531,0.13175167143344879,0.11096601933240891,8.9447416365146637E-2,5.0725556910037994E-2,0.10349979251623154,0.10754202306270599,6.7405954003334045E-2,7.4683241546154022E-2,0.13980218768119812,8.3159118890762329E-2,7.3492825031280518E-2,7.7748760581016541E-2,7.4083134531974792E-2,6.9502241909503937E-2,8.6556389927864075E-2,9.0297892689704895E-2,0.12925657629966736,0.10482442378997803,0.13068179786205292,5.531754344701767E-2,0.10229189693927765,7.2903141379356384E-2,{"$f":"'User Add-in Location'!B103","v":0},{"$f":"'User Add-in Location'!C103","v":0},8.7486661970615387E-2,0,0.10253333300352097,0.12581008672714233,5.8510094881057739E-2,0.11718147248029709,9.8294727504253387E-2,7.2747461497783661E-2,0.10793863236904144,9.7488783299922943E-2,9.3721657991409302E-2,0.13781072199344635,0.10280030220746994,6.7046776413917542E-2,7.0936106145381927E-2,0.11584902554750443,0.12903986871242523,0.22648639976978302,0.11734446138143539,8.6073048412799835E-2,0.10205701738595963,9.204421192407608E-2,6.8021401762962341E-2,9.8615512251853943E-2,3.9074938744306564E-2]
[null,null,"Wholesale Trade",9.6113309264183044E-2,7.1412771940231323E-2,0.15717005729675293,8.004915714263916E-2,0.15466809272766113,0.1693587601184845,0.14914938807487488,0.1242232471704483,5.6770317256450653E-2,0.15061250329017639,0.14070925116539001,0.1033623069524765,9.6592143177986145E-2,0.16824810206890106,0.10677599906921387,0.10130161792039871,0.10363905131816864,9.2163905501365662E-2,8.9036591351032257E-2,0.12125540524721146,0.12983763217926025,0.18683366477489471,0.13898655772209167,0.18301759660243988,7.1326516568660736E-2,0.13927119970321655,9.1974146664142609E-2,{"$f":"'User Add-in Location'!B104","v":0},{"$f":"'User Add-in Location'!C104","v":0},0.10757581889629364,7.7664688229560852E-2,0.17077760398387909,0.16060715913772583,7.160148024559021E-2,0.13669773936271667,0.1422354131937027,8.3165243268013E-2,0.14819803833961487,9.6204325556755066E-2,0.13471022248268127,0.16285702586174011,0.15145552158355713,9.6656039357185364E-2,9.4290345907211304E-2,0.14229705929756165,0.13722944259643555,0.24861553311347961,0.13791711628437042,0.11026239395141602,0.13555516302585602,0.1189730316400528,8.0618396401405334E-2,0.13142415881156921,4.9289684742689133E-2]
[null,null,"Retail Trade",0.10455426573753357,0.10990859568119049,0.17028030753135681,0.10235363245010376,0.17313344776630402,0.17648924887180328,0.17944620549678802,0.14357545971870422,5.7645343244075775E-2,0.17265963554382324,0.1586230993270874,0.1118585467338562,0.11365650594234467,0.18201228976249695,0.11845048516988754,0.11343388259410858,0.10989685356616974,0.12127362191677094,0.10097016394138336,0.14034298062324524,0.14489711821079254,0.20965638756752014,0.14585377275943756,0.18376505374908447,8.6376287043094635E-2,0.15513399243354797,0.12331060320138931,{"$f":"'User Add-in Location'!B105","v":0},{"$f":"'User Add-in Location'!C105","v":0},0.11789817363023758,5.6533001363277435E-2,0.19529081881046295,0.18505021929740906,9.1723404824733734E-2,0.1599789559841156,0.16648422181606293,9.5559701323509216E-2,0.16122065484523773,0.12203708291053772,0.16732653975486755,0.18837149441242218,0.17401677370071411,0.11391493678092957,0.10873106122016907,0.1684613972902298,0.15031802654266357,0.2753351628780365,0.15536946058273315,0.13397930562496185,0.14355073869228363,0.12850359082221985,9.6920415759086609E-2,0.14018870890140533,6.0013893991708755E-2]
[null,null,"FIRE",7.8206546604633331E-2,6.1796572059392929E-2,0.12851446866989136,6.2698222696781158E-2,0.1223742663860321,0.12701913714408875,0.14209847152233124,7.2448059916496277E-2,4.0503397583961487E-2,0.124976746737957,0.10673096030950546,7.1465767920017242E-2,6.8197377026081085E-2,0.1312154233455658,7.3899537324905396E-2,7.5270257890224457E-2,8.2480072975158691E-2,8.025369793176651E-2,6.8600006401538849E-2,8.9268207550048828E-2,9.3044735491275787E-2,0.1594042032957077,0.1041128933429718,0.15468142926692963,5.6557916104793549E-2,0.10296107828617096,6.4958781003952026E-2,{"$f":"'User Add-in Location'!B106","v":0},{"$f":"'User Add-in Location'!C106","v":0},8.1360697746276855E-2,0,0.12064278125762939,0.12645217776298523,4.562847688794136E-2,0.12641012668609619,0.12061743438243866,6.5395168960094452E-2,0.10631218552589417,8.0355554819107056E-2,8.8156037032604218E-2,0.13137373328208923,0.12196839600801468,8.8150948286056519E-2,6.5597698092460632E-2,0.11978045105934143,0.12423213571310043,0.20506180822849274,9.2236913740634918E-2,8.0077908933162689E-2,9.5234796404838562E-2,8.287348598241806E-2,5.8801136910915375E-2,9.1579228639602661E-2,3.4442733973264694E-2]
[null,null,"Misc. Services",0.13663017749786377,0.12762466073036194,0.21511486172676086,0.11744352430105209,0.22832545638084412,0.22436848282814026,0.2137267142534256,0.16316482424736023,7.7069252729415894E-2,0.21273645758628845,0.20023106038570404,0.13930746912956238,0.12416022270917892,0.23292049765586853,0.12460972368717194,0.12693169713020325,0.14299222826957703,0.13715261220932007,0.13084115087985992,0.16520318388938904,0.17851395905017853,0.23877060413360596,0.1975284218788147,0.23120814561843872,9.9788494408130646E-2,0.18325063586235046,0.12577755749225616,{"$f":"'User Add-in Location'!B107","v":0},{"$f":"'User Add-in Location'!C107","v":0},0.13698017597198486,0.11239653080701828,0.20352724194526672,0.22572524845600128,0.10229144245386124,0.19380025565624237,0.17769505083560944,0.11466191709041595,0.20081508159637451,0.13880643248558044,0.15512855350971222,0.21911859512329102,0.19556951522827148,0.14185231924057007,0.11721476167440414,0.19978737831115723,0.19828565418720245,0.34100866317749023,0.18284508585929871,0.14848455786705017,0.19393572211265564,0.16276556253433228,0.11259737610816956,0.16794618964195251,7.0822000503540039E-2]
[null,null,"Professional Services",0.10020158439874649,9.3267567455768585E-2,0.16473440825939178,8.6621470749378204E-2,0.1730511337518692,0.16454513370990753,0.1668114960193634,0.13465327024459839,6.5087750554084778E-2,0.16181512176990509,0.14570055902004242,0.11247842758893967,0.10093313455581665,0.17690357565879822,0.11312173306941986,0.10011539608240128,0.10667608678340912,0.10858170688152313,9.4581872224807739E-2,0.1341235339641571,0.13820642232894897,0.19631309807300568,0.14854660630226135,0.18303413689136505,7.6456882059574127E-2,0.14328640699386597,9.8169103264808655E-2,{"$f":"'User Add-in Location'!B108","v":0},{"$f":"'User Add-in Location'!C108","v":0},0.11401751637458801,8.0097906291484833E-2,0.16641329228878021,0.17623239755630493,7.5736060738563538E-2,0.15345685184001923,0.14754973351955414,8.4745608270168304E-2,0.16009850800037384,0.10352835059165955,0.14404773712158203,0.18072670698165894,0.16109126806259155,0.10286487638950348,0.10041923820972443,0.16434414684772491,0.14599087834358215,0.27031335234642029,0.13725756108760834,0.1205299124121666,0.14391189813613892,0.12340943515300751,9.2372149229049683E-2,0.13372926414012909,5.0549108535051346E-2]
[null,null,"Government",0.15283650159835815,0.16667214035987854,0.2310967743396759,0.1644311398267746,0.25122275948524475,0.25579068064689636,0.21450182795524597,0.18529145419597626,6.9978967308998108E-2,0.24422141909599304,0.24546471238136292,0.1862795352935791,0.17007939517498016,0.28110933303833008,0.19551986455917358,0.17435047030448914,0.18614935874938965,0.18210659921169281,0.16856668889522552,0.22053593397140503,0.18216545879840851,0.21674627065658569,0.23710443079471588,0.26000472903251648,0.14400050044059753,0.23208171129226685,0.16723074018955231,{"$f":"'User Add-in Location'!B109","v":0},{"$f":"'User Add-in Location'!C109","v":0},0.19770041108131409,0.13256825506687164,0.20558694005012512,0.26760929822921753,0.10174676775932312,0.21698160469532013,0.24310961365699768,0.14484240114688873,0.24172484874725342,0.16276641190052032,0.21938565373420715,0.25953295826911926,0.21066252887248993,0.18262436985969543,0.16244806349277496,0.23640771210193634,0.22383598983287811,0.36965274810791016,0.21669599413871765,0.20529082417488098,0.19614987075328827,0.18845605850219727,0.14663015305995941,0.2125554084777832,0.10078434646129608]
[]
[null,null,"Output Per Million Dollars Change in Final Demand"]
[null,null,"  Output Direct Multipliers","Alabama","Alaska","Arizona","Arkansas","California","Colorado","Connecticut","Delaware","District of Columbia","Florida","Georgia","Hawaii","Idaho","Illinois","Indiana","Iowa","Kansas","Kentucky","Louisiana","Maine","Maryland","Massachusetts","Michigan","Minnesota","Mississippi","Missouri","Montana","MyCounty","MyRegion","Nebraska","Nevada","New Hampshire","New Jersey","New Mexico","New York","North Carolina","North Dakota","Ohio","Oklahoma","Oregon","Pennsylvania","Rhode Island","South Carolina","South Dakota","Tennessee","Texas","United States","Utah","Vermont","Virginia","Washington","West Virginia","Wisconsin","Wyoming"]
[null,null,"Agriculture",1,1,1,1,1,1,1,1,1,1,1,1,1,1,1,1,1,1,1,1,1,1,1,1,1,1,1,{"$f":"'User Add-in Location'!B113","v":0},{"$f":"'User Add-in Location'!C113","v":0},1,1,1,1,1,1,1,1,1,1,1,1,1,1,1,1,1,1,1,1,1,1,1,1,1]
[null,null,"Mining",1,1,1,1,1,1,1,1,1,1,1,1,1,1,1,1,1,1,1,1,1,1,1,1,1,1,1,{"$f":"'User Add-in Location'!B114","v":0},{"$f":"'User Add-in Location'!C114","v":0},1,1,1,1,1,1,1,1,1,1,1,1,1,1,1,1,1,1,1,1,1,1,1,1,1]
[null,null,"Construction",1,1,1,1,1,1,1,1,1,1,1,1,1,1,1,1,1,1,1,1,1,1,1,1,1,1,1,{"$f":"'User Add-in Location'!B115","v":0},{"$f":"'User Add-in Location'!C115","v":0},1,1,1,1,1,1,1,1,1,1,1,1,1,1,1,1,1,1,1,1,1,1,1,1,1]
[null,null,"Manufacturing",1,1,1,1,1,1,1,1,1,1,1,1,1,1,1,1,1,1,1,1,1,1,1,1,1,1,1,{"$f":"'User Add-in Location'!B116","v":0},{"$f":"'User Add-in Location'!C116","v":0},1,1,1,1,1,1,1,1,1,1,1,1,1,1,1,1,1,1,1,1,1,1,1,1,1]
[null,null,"Fabricated Metals",1,1,1,1,1,1,1,1,1,1,1,1,1,1,1,1,1,1,1,1,1,1,1,1,1,1,1,{"$f":"'User Add-in Location'!B117","v":0},{"$f":"'User Add-in Location'!C117","v":0},1,1,1,1,1,1,1,1,1,1,1,1,1,1,1,1,1,1,1,1,1,1,1,1,1]
[null,null,"Machinery",1,1,1,1,1,1,1,1,1,1,1,1,1,1,1,1,1,1,1,1,1,1,1,1,1,1,1,{"$f":"'User Add-in Location'!B118","v":0},{"$f":"'User Add-in Location'!C118","v":0},1,1,1,1,1,1,1,1,1,1,1,1,1,1,1,1,1,1,1,1,1,1,1,1,1]
[null,null,"Electrical Equipment",1,1,1,1,1,1,1,1,1,1,1,1,1,1,1,1,1,1,1,1,1,1,1,1,1,1,1,{"$f":"'User Add-in Location'!B119","v":0},{"$f":"'User Add-in Location'!C119","v":0},1,1,1,1,1,1,1,1,1,1,1,1,1,1,1,1,1,1,1,1,1,1,1,1,1]
[null,null,"TCPU",1,1,1,1,1,1,1,1,1,1,1,1,1,1,1,1,1,1,1,1,1,1,1,1,1,1,1,{"$f":"'User Add-in Location'!B120","v":0},{"$f":"'User Add-in Location'!C120","v":0},1,1,1,1,1,1,1,1,1,1,1,1,1,1,1,1,1,1,1,1,1,1,1,1,1]
[null,null,"Wholesale Trade",1,1,1,1,1,1,1,1,1,1,1,1,1,1,1,1,1,1,1,1,1,1,1,1,1,1,1,{"$f":"'User Add-in Location'!B121","v":0},{"$f":"'User Add-in Location'!C121","v":0},1,1,1,1,1,1,1,1,1,1,1,1,1,1,1,1,1,1,1,1,1,1,1,1,1]
[null,null,"Retail Trade",1,1,1,1,1,1,1,1,1,1,1,1,1,1,1,1,1,1,1,1,1,1,1,1,1,1,1,{"$f":"'User Add-in Location'!B122","v":0},{"$f":"'User Add-in Location'!C122","v":0},1,1,1,1,1,1,1,1,1,1,1,1,1,1,1,1,1,1,1,1,1,1,1,1,1]
[null,null,"FIRE",1,1,1,1,1,1,1,1,1,1,1,1,1,1,1,1,1,1,1,1,1,1,1,1,1,1,1,{"$f":"'User Add-in Location'!B123","v":0},{"$f":"'User Add-in Location'!C123","v":0},1,1,1,1,1,1,1,1,1,1,1,1,1,1,1,1,1,1,1,1,1,1,1,1,1]
[null,null,"Misc. Services",1,1,1,1,1,1,1,1,1,1,1,1,1,1,1,1,1,1,1,1,1,1,1,1,1,1,1,{"$f":"'User Add-in Location'!B124","v":0},{"$f":"'User Add-in Location'!C124","v":0},1,1,1,1,1,1,1,1,1,1,1,1,1,1,1,1,1,1,1,1,1,1,1,1,1]
[null,null,"Professional Services",1,1,1,1,1,1,1,1,1,1,1,1,1,1,1,1,1,1,1,1,1,1,1,1,1,1,1,{"$f":"'User Add-in Location'!B125","v":0},{"$f":"'User Add-in Location'!C125","v":0},1,1,1,1,1,1,1,1,1,1,1,1,1,1,1,1,1,1,1,1,1,1,1,1,1]
[null,null,"Government",1,1,1,1,1,1,1,1,1,1,1,1,1,1,1,1,1,1,1,1,1,1,1,1,1,1,1,{"$f":"'User Add-in Location'!B126","v":0},{"$f":"'User Add-in Location'!C126","v":0},1,1,1,1,1,1,1,1,1,1,1,1,1,1,1,1,1,1,1,1,1,1,1,1,1]
[]
[null,null,"Output Per Million Dollars Change in Final Demand"]
[null,null,"  Output Indirect Multipliers","Alabama","Alaska","Arizona","Arkansas","California","Colorado","Connecticut","Delaware","District of Columbia","Florida","Georgia","Hawaii","Idaho","Illinois","Indiana","Iowa","Kansas","Kentucky","Louisiana","Maine","Maryland","Massachusetts","Michigan","Minnesota","Mississippi","Missouri","Montana","MyCounty","MyRegion","Nebraska","Nevada","New Hampshire","New Jersey","New Mexico","New York","North Carolina","North Dakota","Ohio","Oklahoma","Oregon","Pennsylvania","Rhode Island","South Carolina","South Dakota","Tennessee","Texas","United States","Utah","Vermont","Virginia","Washington","West Virginia","Wisconsin","Wyoming"]
[null,null,"Agriculture",0.26157271862030029,0.10876667499542236,0.21263396739959717,0.40233433246612549,0.18266880512237549,0.43537545204162598,0.10988247394561768,0.31075286865234375,0.13212990760803223,0.15501177310943604,0.29092717170715332,0.13808989524841309,0.36452841758728027,0.30969762802124023,0.21295523643493652,0.35397875308990479,0.46925270557403564,0.19515490531921387,0.16306221485137939,0.19720542430877686,0.18589794635772705,9.7021937370300293E-2,0.21246445178985596,0.36046338081359863,0.26462638378143311,0.26113200187683105,0.36063647270202637,{"$f":"'User Add-in Location'!B130","v":0},{"$f":"'User Add-in Location'!C130","v":0},0.46627557277679443,9.9615693092346191E-2,0.14453685283660889,9.6693277359008789E-2,0.25976324081420898,0.20423352718353271,0.23688197135925293,0.32466840744018555,0.2362443208694458,0.27843630313873291,0.22565579414367676,0.23627805709838867,9.8947048187255859E-2,0.17169868946075439,0.42417252063751221,0.20046448707580566,0.33491361141204834,0.63790655136108398,0.24776935577392578,0.30969727039337158,0.20997607707977295,0.17596614360809326,0.15225315093994141,0.38006722927093506,0.19798374176025391]
[null,null,"Mining",0.24988961219787598,0.12598335742950439,0.32482612133026123,0.28941166400909424,0.24997413158416748,0.31567716598510742,0.31345880031585693,0.28373849391937256,0.24335992336273193,0.47727441787719727,0.29525887966156006,0.31390416622161865,0.3093874454498291,0.35704004764556885,0.30276119709014893,0.2687833309173584,0.52029287815093994,0.28278148174285889,0.24060678482055664,0.42488527297973633,0.39102184772491455,0.41548383235931396,0.4090193510055542,0.29601788520812988,0.28491306304931641,0.32036685943603516,0.36254918575286865,{"$f":"'User Add-in Location'!B131","v":0},{"$f":"'User Add-in Location'!C131","v":0},0.2833627462387085,0.19620883464813232,0.30438148975372314,0.35963523387908936,0.3321077823638916,0.37904763221740723,0.27946710586547852,0.22910046577453613,0.37685668468475342,0.4083627462387085,0.38049781322479248,0.283622145652771,0.32722926139831543,0.28583598136901855,0.32389247417449951,0.29014575481414795,0.30056118965148926,0.51409494876861572,0.34032070636749268,0.23893749713897705,0.30193018913269043,0.35655653476715088,0.33017182350158691,0.2439274787902832,0.25366902351379395]
[null,null,"Construction",0.38916492462158203,0.28123247623443604,0.39715981483459473,0.39712762832641602,0.52964448928833008,0.47307956218719482,0.3889995813369751,0.36489951610565186,0.18371069431304932,0.4605940580368042,0.45488548278808594,0.31091737747192383,0.42445194721221924,0.42869234085083008,0.40114152431488037,0.36245036125183105,0.41443502902984619,0.36311328411102295,0.34797549247741699,0.4450608491897583,0.33105885982513428,0.39448988437652588,0.458640456199646,0.44953835010528564,0.34779047966003418,0.431740403175354,0.39101612567901611,{"$f":"'User Add-in Location'!B132","v":0},{"$f":"'User Add-in Location'!C132","v":0},0.371512770652771,0.16153419017791748,0.42651462554931641,0.38594460487365723,0.35141170024871826,0.35484695434570313,0.45969498157501221,0.34094035625457764,0.484732985496521,0.42571580410003662,0.39993727207183838,0.45307517051696777,0.33240389823913574,0.37586414813995361,0.38148486614227295,0.44695818424224854,0.51713383197784424,0.9154200553894043,0.46621942520141602,0.39622008800506592,0.37509894371032715,0.41225874423980713,0.27503347396850586,0.43158376216888428,0.26344728469848633]
[null,null,"Manufacturing",0.3344123363494873,0.39449608325958252,0.35610771179199219,0.38265585899353027,0.53448808193206787,0.47489321231842041,0.26870274543762207,0.3025895357131958,0.12852728366851807,0.39389646053314209,0.36730241775512695,0.36630380153656006,0.39698696136474609,0.4058384895324707,0.31643342971801758,0.34504532814025879,0.45289885997772217,0.31033265590667725,0.38727796077728271,0.32791328430175781,0.24533963203430176,0.29886627197265625,0.37695908546447754,0.44561517238616943,0.33668303489685059,0.35196983814239502,0.41470348834991455,{"$f":"'User Add-in Location'!B133","v":0},{"$f":"'User Add-in Location'!C133","v":0},0.36661076545715332,0.19642078876495361,0.26139223575592041,0.33242559432983398,0.42901742458343506,0.31921303272247314,0.33699488639831543,0.40972054004669189,0.41225337982177734,0.46427202224731445,0.36918509006500244,0.40912425518035889,0.26079308986663818,0.28367376327514648,0.34844779968261719,0.33032238483428955,0.63190865516662598,1.0921313762664795,0.46310436725616455,0.33806169033050537,0.27148914337158203,0.3828885555267334,0.28209364414215088,0.3858189582824707,0.39157652854919434]
[null,null,"Fabricated Metals",0.29140353202819824,0.2995305061340332,0.34711205959320068,0.26948642730712891,0.54984128475189209,0.39103841781616211,0.28394925594329834,0.25335240364074707,0,0.38344454765319824,0.35021018981933594,0.32520675659179688,0.31689167022705078,0.3877178430557251,0.3140714168548584,0.27789509296417236,0.30912435054779053,0.27358067035675049,0.279610276222229,0.2907860279083252,0.26515316963195801,0.31354010105133057,0.36986827850341797,0.40151429176330566,0.2642066478729248,0.31392371654510498,0.30038559436798096,{"$f":"'User Add-in Location'!B134","v":0},{"$f":"'User Add-in Location'!C134","v":0},0.26926243305206299,0.17982447147369385,0.26360666751861572,0.3257133960723877,0.29929137229919434,0.31788372993469238,0.36931288242340088,0.271728515625,0.38698101043701172,0.29759252071380615,0.33671724796295166,0.37948310375213623,0.29347085952758789,0.26283299922943115,0.24922895431518555,0.31190001964569092,0.51178669929504395,1.0504641532897949,0.4341433048248291,0.25798332691192627,0.26179420948028564,0.37797951698303223,0.21770584583282471,0.3396296501159668,0.22744143009185791]
[null,null,"Machinery",0.34155237674713135,0.29713833332061768,0.33325469493865967,0.33336055278778076,0.54007112979888916,0.45226085186004639,0.30527234077453613,0.24576699733734131,0.20273840427398682,0.42598855495452881,0.37166249752044678,0.39293575286865234,0.36100435256958008,0.38464975357055664,0.35881149768829346,0.28663027286529541,0.37257266044616699,0.31368649005889893,0.32164263725280762,0.3141629695892334,0.31235218048095703,0.33630239963531494,0.37974274158477783,0.47189652919769287,0.29356229305267334,0.3990706205368042,0.36462676525115967,{"$f":"'User Add-in Location'!B135","v":0},{"$f":"'User Add-in Location'!C135","v":0},0.2980039119720459,0.19985246658325195,0.21808755397796631,0.32617533206939697,0.31599628925323486,0.32724881172180176,0.3396761417388916,0.32859981060028076,0.41274642944335938,0.30493450164794922,0.37514305114746094,0.38981366157531738,0.2517850399017334,0.27832889556884766,0.31413912773132324,0.34461784362792969,0.51205968856811523,1.1309583187103271,0.4357222318649292,0.23416042327880859,0.29168474674224854,0.41285824775695801,0.2065126895904541,0.38984131813049316,0.27953863143920898]
[null,null,"Electrical Equipment",0.33950340747833252,0,0.47571718692779541,0.33786857128143311,0.62066030502319336,0.48079788684844971,0.35082650184631348,0.27194023132324219,0.12318634986877441,0.48749637603759766,0.40869343280792236,0.33306431770324707,0.4153292179107666,0.40182149410247803,0.30553388595581055,0.30883336067199707,0.3095853328704834,0.33051657676696777,0.28489696979522705,0.32363748550415039,0.32188832759857178,0.47055280208587646,0.42393946647644043,0.5301671028137207,0.322487473487854,0.29522383213043213,0.3837273120880127,{"$f":"'User Add-in Location'!B136","v":0},{"$f":"'User Add-in Location'!C136","v":0},0.30598700046539307,0.16617631912231445,0.35654592514038086,0.39458239078521729,0.29185390472412109,0.42979168891906738,0.42050635814666748,0.3686295747756958,0.42824101448059082,0.35281014442443848,0.2317739725112915,0.39227879047393799,0.36557590961456299,0.27165794372558594,0.33923649787902832,0.32939398288726807,0.54335534572601318,0.91872119903564453,0.50663936138153076,0.43539762496948242,0.36633503437042236,0.42195022106170654,0.28236496448516846,0.39617645740509033,0.29132616519927979]
[null,null,"TCPU",0.47965860366821289,0.33448517322540283,0.46461653709411621,0.44298136234283447,0.50138568878173828,0.5193641185760498,0.38134801387786865,0.39891564846038818,0.2434389591217041,0.49805128574371338,0.47961187362670898,0.38816666603088379,0.43269073963165283,0.50674223899841309,0.44379830360412598,0.40597403049468994,0.43143630027770996,0.42356026172637939,0.48765528202056885,0.38985288143157959,0.39249503612518311,0.42316508293151855,0.47121632099151611,0.54934000968933105,0.43946874141693115,0.45268237590789795,0.47140562534332275,{"$f":"'User Add-in Location'!B137","v":0},{"$f":"'User Add-in Location'!C137","v":0},0.29682314395904541,0,0.38048946857452393,0.38786447048187256,0.45615172386169434,0.45881927013397217,0.41966378688812256,0.45369160175323486,0.45156514644622803,0.4931032657623291,0.41049325466156006,0.46567809581756592,0.36610221862792969,0.40209317207336426,0.42768526077270508,0.47006213665008545,0.57927072048187256,0.87065482139587402,0.54225242137908936,0.44525671005249023,0.39929664134979248,0.42378878593444824,0.42800605297088623,0.43369638919830322,0.41115915775299072]
[null,null,"Wholesale Trade",0.34100556373596191,0.28620302677154541,0.41215777397155762,0.3005603551864624,0.41196525096893311,0.42914581298828125,0.33092212677001953,0.32071232795715332,0.26084721088409424,0.42724728584289551,0.3789360523223877,0.39804303646087646,0.38926589488983154,0.39240849018096924,0.34674942493438721,0.34936332702636719,0.34553408622741699,0.31257331371307373,0.30721151828765869,0.38037741184234619,0.35277366638183594,0.38669013977050781,0.36094081401824951,0.41762697696685791,0.31226801872253418,0.40475344657897949,0.35264754295349121,{"$f":"'User Add-in Location'!B138","v":0},{"$f":"'User Add-in Location'!C138","v":0},0.37944138050079346,0.26137828826904297,0.3745121955871582,0.34836256504058838,0.36731636524200439,0.35212302207946777,0.39530611038208008,0.30793917179107666,0.40365540981292725,0.35549938678741455,0.39007854461669922,0.37293171882629395,0.40083062648773193,0.32827019691467285,0.34740257263183594,0.37098896503448486,0.36747908592224121,0.53838193416595459,0.46256649494171143,0.38232612609863281,0.3528134822845459,0.36096012592315674,0.28721034526824951,0.39792561531066895,0.24436569213867188]
[null,null,"Retail Trade",0.30420947074890137,0.29237914085388184,0.37288343906402588,0.32004356384277344,0.35289716720581055,0.42052328586578369,0.35092651844024658,0.3723137378692627,0.26917016506195068,0.41910779476165771,0.39616644382476807,0.2910609245300293,0.35305249691009521,0.40739941596984863,0.33877623081207275,0.36667037010192871,0.33840250968933105,0.33695137500762939,0.28668725490570068,0.3665999174118042,0.34122598171234131,0.40427279472351074,0.34669768810272217,0.42026102542877197,0.2898719310760498,0.40307724475860596,0.36958932876586914,{"$f":"'User Add-in Location'!B139","v":0},{"$f":"'User Add-in Location'!C139","v":0},0.38013374805450439,0.23180580139160156,0.37598931789398193,0.34873902797698975,0.30966079235076904,0.34548568725585938,0.40151715278625488,0.32538127899169922,0.38955545425415039,0.34472465515136719,0.40602743625640869,0.4096987247467041,0.37482821941375732,0.32083892822265625,0.34346365928649902,0.34891641139984131,0.36935126781463623,0.52558112144470215,0.42124748229980469,0.33490526676177979,0.35300374031066895,0.29409492015838623,0.27172338962554932,0.39020133018493652,0.26500999927520752]
[null,null,"FIRE",0.4217524528503418,0.28640508651733398,0.54892396926879883,0.39244258403778076,0.41450536251068115,0.57490444183349609,0.40700268745422363,0.26879394054412842,0.23886871337890625,0.60147881507873535,0.44477427005767822,0.33747649192810059,0.51972544193267822,0.44915759563446045,0.38313353061676025,0.3941795825958252,0.44372892379760742,0.39694356918334961,0.38217341899871826,0.41181826591491699,0.37012684345245361,0.40160965919494629,0.44398784637451172,0.50293397903442383,0.40033698081970215,0.44375431537628174,0.41365110874176025,{"$f":"'User Add-in Location'!B140","v":0},{"$f":"'User Add-in Location'!C140","v":0},0.44138622283935547,0,0.41840577125549316,0.43952357769012451,0.35037112236022949,0.28044188022613525,0.3626558780670166,0.39328157901763916,0.41707003116607666,0.47586524486541748,0.42749297618865967,0.45906758308410645,0.41791021823883057,0.41585624217987061,0.3156818151473999,0.41804802417755127,0.56741130352020264,0.57829642295837402,0.53525471687316895,0.38572585582733154,0.37818872928619385,0.38798403739929199,0.29696226119995117,0.43972611427307129,0.3699260950088501]
[null,null,"Misc. Services",0.38628816604614258,0.31786978244781494,0.46608376502990723,0.39165616035461426,0.42437958717346191,0.47445487976074219,0.41380620002746582,0.34579896926879883,0.22174918651580811,0.47167015075683594,0.41486966609954834,0.37187433242797852,0.43909263610839844,0.39735829830169678,0.35587632656097412,0.39507818222045898,0.41916477680206299,0.37393879890441895,0.32879519462585449,0.45334279537200928,0.39430892467498779,0.42665541172027588,0.43686187267303467,0.45918095111846924,0.35947632789611816,0.42736959457397461,0.39946639537811279,{"$f":"'User Add-in Location'!B141","v":0},{"$f":"'User Add-in Location'!C141","v":0},0.4114537239074707,0.26530122756958008,0.43197810649871826,0.38891541957855225,0.39384901523590088,0.351326584815979,0.42596137523651123,0.34562242031097412,0.45413601398468018,0.39112448692321777,0.37450551986694336,0.42296552658081055,0.46507358551025391,0.39091038703918457,0.42247021198272705,0.39108002185821533,0.4067535400390625,0.57062530517578125,0.53364002704620361,0.43545436859130859,0.34614670276641846,0.41244590282440186,0.31863820552825928,0.43985521793365479,0.29783463478088379]
[null,null,"Professional Services",0.33093249797821045,0.29368448257446289,0.42724990844726563,0.30985057353973389,0.42177236080169678,0.42338454723358154,0.35158705711364746,0.32870841026306152,0.2519991397857666,0.44656896591186523,0.42517244815826416,0.32880425453186035,0.38498187065124512,0.41537249088287354,0.3415524959564209,0.34148228168487549,0.35515546798706055,0.33152151107788086,0.30995571613311768,0.37833380699157715,0.34729206562042236,0.38737916946411133,0.38440096378326416,0.41745758056640625,0.31873667240142822,0.40501070022583008,0.36160266399383545,{"$f":"'User Add-in Location'!B142","v":0},{"$f":"'User Add-in Location'!C142","v":0},0.37310409545898438,0.21962976455688477,0.35029399394989014,0.36487197875976563,0.3661952018737793,0.36079156398773193,0.39786779880523682,0.30581104755401611,0.39929306507110596,0.35687518119812012,0.38378989696502686,0.37549149990081787,0.38140726089477539,0.34931778907775879,0.34444880485534668,0.36289370059967041,0.42366230487823486,0.59797477722167969,0.4546583890914917,0.35840213298797607,0.3389592170715332,0.36352157592773438,0.27275323867797852,0.36917376518249512,0.26072967052459717]
[null,null,"Government",9.7743868827819824E-2,3.9212584495544434E-2,0.15586042404174805,8.5851907730102539E-2,0.10636031627655029,7.4970722198486328E-2,0.16365969181060791,1.9808411598205566E-2,8.2895755767822266E-3,9.08050537109375E-2,1.7363071441650391E-2,5.4685354232788086E-2,0.11917173862457275,4.8960328102111816E-2,5.913841724395752E-2,8.0619096755981445E-2,9.2899799346923828E-2,8.6897373199462891E-2,0.1208881139755249,9.8780512809753418E-2,2.4924397468566895E-2,3.6141276359558105E-2,7.1975111961364746E-2,0.15694725513458252,7.0223331451416016E-2,8.8896274566650391E-2,0.10127687454223633,{"$f":"'User Add-in Location'!B143","v":0},{"$f":"'User Add-in Location'!C143","v":0},8.1853747367858887E-2,0.13637864589691162,6.164395809173584E-2,5.3609609603881836E-2,0.11365509033203125,0.1036536693572998,4.9648880958557129E-2,0.215728759765625,6.9166898727416992E-2,0.2131960391998291,0.10886967182159424,9.5174431800842285E-2,4.2770981788635254E-2,8.7129950523376465E-2,0.22138702869415283,0.12035107612609863,9.3724370002746582E-2,0.13899219036102295,6.9188237190246582E-2,4.1929841041564941E-2,7.170403003692627E-2,0.15832269191741943,8.1882357597351074E-2,0.11398184299468994,8.1573486328125E-2]
[]
[null,null,"Output Per Million Dollars Change in Final Demand"]
[null,null,"  Output Induced Multipliers","Alabama","Alaska","Arizona","Arkansas","California","Colorado","Connecticut","Delaware","District of Columbia","Florida","Georgia","Hawaii","Idaho","Illinois","Indiana","Iowa","Kansas","Kentucky","Louisiana","Maine","Maryland","Massachusetts","Michigan","Minnesota","Mississippi","Missouri","Montana","MyCounty","MyRegion","Nebraska","Nevada","New Hampshire","New Jersey","New Mexico","New York","North Carolina","North Dakota","Ohio","Oklahoma","Oregon","Pennsylvania","Rhode Island","South Carolina","South Dakota","Tennessee","Texas","United States","Utah","Vermont","Virginia","Washington","West Virginia","Wisconsin","Wyoming"]
[null,null,"Agriculture",0.26173236966133118,0.27686005830764771,0.31367236375808716,0.25133934617042542,0.43952274322509766,0.28453448414802551,0.22752030193805695,0.17364136874675751,9.3155868351459503E-2,0.41402333974838257,0.45233330130577087,0.36244013905525208,0.34008705615997314,0.54503720998764038,0.32598143815994263,0.24405182898044586,0.25150087475776672,0.24901650846004486,0.29502525925636292,0.35311135649681091,0.2215668261051178,0.35018879175186157,0.29447469115257263,0.31973034143447876,0.2733285129070282,0.2891729474067688,0.18940055370330811,{"$f":"'User Add-in Location'!B147","v":0},{"$f":"'User Add-in Location'!C147","v":0},0.26437512040138245,0.14215020835399628,0.26020064949989319,0.41044670343399048,0.32551264762878418,0.26026785373687744,0.28689175844192505,0.14335881173610687,0.29738238453865051,0.15332901477813721,0.37500998377799988,0.24155701696872711,0.27420118451118469,0.25800341367721558,0.28201338648796082,0.23277275264263153,0.24320392310619354,0.69063180685043335,0.19665001332759857,0.22439698874950409,0.17494046688079834,0.40458777546882629,5.775134265422821E-2,0.30715435743331909,9.9955491721630096E-2]
[null,null,"Mining",0.13973802328109741,0.10078389942646027,0.23008304834365845,0.19001428782939911,0.24479267001152039,0.39691060781478882,0.23684783279895782,0.35142144560813904,8.4437936544418335E-2,0.21929895877838135,0.28224337100982666,0.16851222515106201,0.19884210824966431,0.23681208491325378,0.22168746590614319,0.16458545625209808,0.29396969079971313,0.15273422002792358,0.18811434507369995,0.18056108057498932,0.19139815866947174,0.32496050000190735,0.28443676233291626,0.26385140419006348,0.22770310938358307,0.21596157550811768,0.23064503073692322,{"$f":"'User Add-in Location'!B148","v":0},{"$f":"'User Add-in Location'!C148","v":0},0.21056519448757172,0.1298101395368576,0.20430389046669006,0.39676278829574585,0.19418701529502869,0.35012912750244141,0.14873886108398438,0.19048143923282623,0.2890300452709198,0.32831975817680359,0.21956232190132141,0.26231688261032104,0.25405865907669067,0.14579415321350098,0.16412216424942017,0.19064855575561523,0.32414078712463379,0.57445555925369263,0.28199678659439087,0.147048220038414,0.24351787567138672,0.17347799241542816,0.15182660520076752,0.20896533131599426,0.10325189679861069]
[null,null,"Construction",0.28961315751075745,0.27299535274505615,0.3950732946395874,0.25972375273704529,0.44126397371292114,0.43198758363723755,0.38612577319145203,0.3115060031414032,0.10533727705478668,0.38461726903915405,0.38078084588050842,0.30617249011993408,0.27532663941383362,0.42739376425743103,0.32054296135902405,0.29622548818588257,0.30905419588088989,0.26944345235824585,0.28081837296485901,0.33159610629081726,0.35874131321907043,0.40234270691871643,0.37620684504508972,0.42065536975860596,0.23008561134338379,0.38885143399238586,0.26508522033691406,{"$f":"'User Add-in Location'!B149","v":0},{"$f":"'User Add-in Location'!C149","v":0},0.31442642211914063,0.18193970620632172,0.40910753607749939,0.41266340017318726,0.24689936637878418,0.3248177170753479,0.35713762044906616,0.26575389504432678,0.41730186343193054,0.31728145480155945,0.36649060249328613,0.4309840202331543,0.34476375579833984,0.27514004707336426,0.27112331986427307,0.4040730893611908,0.41944700479507446,0.83140027523040771,0.41096720099449158,0.30752995610237122,0.32921421527862549,0.36406496167182922,0.24132034182548523,0.36860984563827515,0.16264320909976959]
[null,null,"Manufacturing",0.14524440467357635,0.11487080901861191,0.27256962656974792,0.15080870687961578,0.29503726959228516,0.28713375329971313,0.2495947927236557,0.14370977878570557,6.4167790114879608E-2,0.26929089426994324,0.23127566277980804,0.14213776588439941,0.16006304323673248,0.25659230351448059,0.1591709703207016,0.16166782379150391,0.18116879463195801,0.13531927764415741,0.10169459134340286,0.21030201017856598,0.19453442096710205,0.25394982099533081,0.21715985238552094,0.28309562802314758,0.12093354761600494,0.20544338226318359,0.11205016076564789,{"$f":"'User Add-in Location'!B150","v":0},{"$f":"'User Add-in Location'!C150","v":0},0.16050726175308228,0.11976814270019531,0.25303405523300171,0.23119105398654938,0.12993805110454559,0.19517409801483154,0.19146372377872467,0.12020553648471832,0.23076391220092773,0.19001771509647369,0.22418177127838135,0.24188731610774994,0.23264004290103912,0.15410222113132477,0.16114635765552521,0.19659850001335144,0.22483472526073456,0.60512769222259521,0.22928795218467712,0.1828683465719223,0.17687800526618958,0.205501988530159,0.11189594119787216,0.23117527365684509,6.0223385691642761E-2]
[null,null,"Fabricated Metals",0.21201802790164948,0.19730366766452789,0.34046578407287598,0.20092999935150146,0.38802319765090942,0.33152100443840027,0.30902880430221558,0.23970939218997955,0,0.34555906057357788,0.30520522594451904,0.23639655113220215,0.22328154742717743,0.37117499113082886,0.23853029310703278,0.22120319306850433,0.229241743683815,0.23197324573993683,0.21262802183628082,0.26465922594070435,0.27360779047012329,0.33175531029701233,0.3295343816280365,0.39352908730506897,0.18357641994953156,0.30718165636062622,0.21455872058868408,{"$f":"'User Add-in Location'!B151","v":0},{"$f":"'User Add-in Location'!C151","v":0},0.2265879362821579,0.15129725635051727,0.29677847027778625,0.34713295102119446,0.17562295496463776,0.26901945471763611,0.28533273935317993,0.179806187748909,0.34334331750869751,0.24691866338253021,0.29316526651382446,0.34092268347740173,0.30413264036178589,0.23880736529827118,0.18681645393371582,0.316404789686203,0.33899363875389099,0.765735924243927,0.32310119271278381,0.25443536043167114,0.28501886129379272,0.28639814257621765,0.1694628894329071,0.31421074271202087,0.11549053341150284]
[null,null,"Machinery",0.14806976914405823,0.12751619517803192,0.24160581827163696,0.15119948983192444,0.3202269971370697,0.25675800442695618,0.25476604700088501,0.21060322225093842,6.7332535982131958E-2,0.27288421988487244,0.22879977524280548,0.15701974928379059,0.14904852211475372,0.25491419434547424,0.17018818855285645,0.14492864906787872,0.16784065961837769,0.16610845923423767,0.15385930240154266,0.23570933938026428,0.17835727334022522,0.29715156555175781,0.27009093761444092,0.29838624596595764,0.10379146039485931,0.19589650630950928,0.1210637241601944,{"$f":"'User Add-in Location'!B152","v":0},{"$f":"'User Add-in Location'!C152","v":0},0.13989944756031036,0.11702301353216171,0.37422186136245728,0.30625489354133606,0.12695541977882385,0.21009731292724609,0.21947725117206573,0.11319733411073685,0.28310853242874146,0.19770203530788422,0.23255528509616852,0.27012050151824951,0.26817724108695984,0.19076055288314819,0.13413810729980469,0.20702485740184784,0.26341396570205688,0.63894814252853394,0.23275470733642578,0.25203150510787964,0.21954357624053955,0.24365878105163574,0.17501291632652283,0.21025265753269196,7.7684089541435242E-2]
[null,null,"Electrical Equipment",0.22486096620559692,0,0.30262142419815063,0.18906368315219879,0.36792311072349548,0.2779407799243927,0.26355940103530884,0.24361139535903931,4.0850032120943069E-2,0.30007690191268921,0.24744506180286407,0.12092538177967072,0.21105378866195679,0.32993590831756592,0.23070371150970459,0.19273146986961365,0.21434234082698822,0.21574610471725464,0.19781693816184998,0.19111433625221252,0.23462995886802673,0.27482175827026367,0.30933618545532227,0.32160621881484985,0.13728156685829163,0.25383901596069336,0.13170920312404633,{"$f":"'User Add-in Location'!B153","v":0},{"$f":"'User Add-in Location'!C153","v":0},0.23695418238639832,0.13212406635284424,0.28988727927207947,0.2917918860912323,0.13408496975898743,0.22630232572555542,0.21854761242866516,0.15902848541736603,0.28578990697860718,0.22577494382858276,0.12839607894420624,0.2894212007522583,0.19894424080848694,0.24335932731628418,0.17172981798648834,0.26778140664100647,0.27392330765724182,0.59997671842575073,0.25305861234664917,0.20799486339092255,0.22446624934673309,0.20990817248821259,0.12608268857002258,0.2858751118183136,9.5573775470256805E-2]
[null,null,"TCPU",0.21814499795436859,0.12589395046234131,0.31677177548408508,0.23967145383358002,0.38544002175331116,0.38151445984840393,0.28039926290512085,0.24238617718219757,0.1060519814491272,0.31197890639305115,0.32774639129638672,0.20156840980052948,0.23980547487735748,0.38936224579811096,0.25597718358039856,0.22655998170375824,0.24000035226345062,0.22076013684272766,0.2142951637506485,0.25952154397964478,0.24925422668457031,0.31126514077186584,0.3076438307762146,0.36213159561157227,0.1844770759344101,0.30401322245597839,0.22890777885913849,{"$f":"'User Add-in Location'!B154","v":0},{"$f":"'User Add-in Location'!C154","v":0},0.26270142197608948,0,0.26731029152870178,0.3249947726726532,0.20332843065261841,0.29287302494049072,0.28567466139793396,0.2141706794500351,0.31785726547241211,0.30055370926856995,0.26993036270141602,0.36708655953407288,0.2785986065864563,0.20856104791164398,0.21542127430438995,0.31409841775894165,0.38552775979042053,0.70390290021896362,0.37549939751625061,0.25199785828590393,0.28045612573623657,0.27886390686035156,0.20113644003868103,0.29689392447471619,0.13040526211261749]
[null,null,"Wholesale Trade",0.30010741949081421,0.20559020340442657,0.46250593662261963,0.26238840818405151,0.43554052710533142,0.49050381779670715,0.37689727544784546,0.33664458990097046,0.11868631839752197,0.45399650931358337,0.42883136868476868,0.30908921360969543,0.31018823385238647,0.46860319375991821,0.3286927342414856,0.3122996985912323,0.31995391845703125,0.27464905381202698,0.27454671263694763,0.3635827898979187,0.35842007398605347,0.44993102550506592,0.4079192578792572,0.50717294216156006,0.23788389563560486,0.41393741965293884,0.28880330920219421,{"$f":"'User Add-in Location'!B155","v":0},{"$f":"'User Add-in Location'!C155","v":0},0.32309260964393616,0.21459978818893433,0.4452613890171051,0.41491261124610901,0.24884694814682007,0.34165626764297485,0.41340330243110657,0.24484065175056458,0.43644508719444275,0.29668739438056946,0.38800930976867676,0.43384754657745361,0.41046905517578125,0.30067634582519531,0.2863718569278717,0.38581934571266174,0.41010323166847229,0.77274608612060547,0.44133594632148743,0.32284238934516907,0.37252596020698547,0.36045688390731812,0.23840081691741943,0.39569836854934692,0.16450811922550201]
[null,null,"Retail Trade",0.32644197344779968,0.31640574336051941,0.50105923414230347,0.33545529842376709,0.4875011146068573,0.51112246513366699,0.4534376859664917,0.38907244801521301,0.12050914764404297,0.52045780420303345,0.48341134190559387,0.3344840407371521,0.36496180295944214,0.50693321228027344,0.36460772156715393,0.34969639778137207,0.33925330638885498,0.36137092113494873,0.31132549047470093,0.42080795764923096,0.39996746182441711,0.50488245487213135,0.42806908488273621,0.50922989845275879,0.28804808855056763,0.46106606721878052,0.38718026876449585,{"$f":"'User Add-in Location'!B156","v":0},{"$f":"'User Add-in Location'!C156","v":0},0.35408535599708557,0.15620535612106323,0.50912213325500488,0.47802391648292542,0.31875541806221008,0.39984217286109924,0.48385587334632874,0.28132659196853638,0.4747651219367981,0.3763086199760437,0.48194104433059692,0.50177878141403198,0.4715924859046936,0.35434889793395996,0.33021557331085205,0.45671975612640381,0.449189692735672,0.85575693845748901,0.49713212251663208,0.39225631952285767,0.39448526501655579,0.38932830095291138,0.28658530116081238,0.42207026481628418,0.20028650760650635]
[null,null,"FIRE",0.24417872726917267,0.17785170674324036,0.378143310546875,0.20548941195011139,0.34453186392784119,0.3678576648235321,0.35906553268432617,0.19632977247238159,8.4668770432472229E-2,0.37671378254890442,0.3252485990524292,0.21362781524658203,0.21896086633205414,0.36545756459236145,0.22747209668159485,0.23203863203525543,0.25461852550506592,0.23913957178592682,0.21149379014968872,0.26764139533042908,0.25683110952377319,0.38384771347045898,0.30554211139678955,0.42863300442695618,0.18858569860458374,0.30600708723068237,0.20395570993423462,{"$f":"'User Add-in Location'!B157","v":0},{"$f":"'User Add-in Location'!C157","v":0},0.24434372782707214,0,0.3145124614238739,0.32666566967964172,0.15856857597827911,0.31594336032867432,0.35047578811645508,0.19249126315116882,0.31303030252456665,0.24777005612850189,0.25391417741775513,0.34995138645172119,0.33053582906723022,0.27415379881858826,0.19917792081832886,0.32472071051597595,0.37124142050743103,0.6373174786567688,0.29511916637420654,0.23441608250141144,0.26169314980506897,0.25105908513069153,0.17384138703346252,0.27572348713874817,0.11491024494171143]
[null,null,"Misc. Services",0.4265916645526886,0.36734485626220703,0.63298994302749634,0.38491037487983704,0.64291673898696899,0.64978939294815063,0.54004228115081787,0.44218140840530396,0.16107729077339172,0.64124822616577148,0.61018061637878418,0.41653454303741455,0.39870598912239075,0.64867764711380005,0.38353589177131653,0.39128562808036804,0.44143161177635193,0.40867459774017334,0.40340036153793335,0.49531745910644531,0.49276021122932434,0.57497686147689819,0.57973545789718628,0.64069193601608276,0.33276793360710144,0.54461270570755005,0.39494231343269348,{"$f":"'User Add-in Location'!B158","v":0},{"$f":"'User Add-in Location'!C158","v":0},0.41138347983360291,0.31055399775505066,0.53059291839599609,0.58310794830322266,0.35550731420516968,0.48434945940971375,0.51644629240036011,0.33757513761520386,0.59133046865463257,0.4280516505241394,0.44679051637649536,0.5836794376373291,0.52997231483459473,0.44124037027359009,0.35598373413085938,0.54163509607315063,0.59252333641052246,1.059852123260498,0.58509147167205811,0.43470746278762817,0.53292709589004517,0.4930901825428009,0.33290320634841919,0.50562798976898193,0.2363499253988266]
[null,null,"Professional Services",0.31284359097480774,0.26847732067108154,0.48474431037902832,0.28391236066818237,0.4872765839099884,0.47653096914291382,0.42151585221290588,0.36486226320266724,0.13605676591396332,0.48774948716163635,0.44402337074279785,0.33633455634117126,0.32410436868667603,0.49269163608551025,0.34820252656936646,0.3086395263671875,0.3293147087097168,0.32355380058288574,0.29161834716796875,0.40215960144996643,0.3814888596534729,0.47274905443191528,0.43596893548965454,0.50721275806427002,0.25497165322303772,0.42585626244544983,0.30824905633926392,{"$f":"'User Add-in Location'!B159","v":0},{"$f":"'User Add-in Location'!C159","v":0},0.34242957830429077,0.22131867706775665,0.43385159969329834,0.45525550842285156,0.26318809390068054,0.38353544473648071,0.42883086204528809,0.24948796629905701,0.47146886587142944,0.31925368309020996,0.41489356756210327,0.4814075231552124,0.43656671047210693,0.31996974349021912,0.3049776554107666,0.44553279876708984,0.43625849485397339,0.84014588594436646,0.43920516967773438,0.35287997126579285,0.395467609167099,0.37388390302658081,0.27313068509101868,0.40263217687606812,0.16869121789932251]
[null,null,"Government",0.47728139162063599,0.47990638017654419,0.68012440204620361,0.53903692960739136,0.7075238823890686,0.74092209339141846,0.54207617044448853,0.50224471092224121,0.14631675183773041,0.73626220226287842,0.74817466735839844,0.5571027398109436,0.54629707336425781,0.7830275297164917,0.60194504261016846,0.53758335113525391,0.57475167512893677,0.54273867607116699,0.51987588405609131,0.66136395931243896,0.50290948152542114,0.52200126647949219,0.6959877610206604,0.72057229280471802,0.48034310340881348,0.68987315893173218,0.52523499727249146,{"$f":"'User Add-in Location'!B160","v":0},{"$f":"'User Add-in Location'!C160","v":0},0.59384584426879883,0.36632093787193298,0.53606575727462769,0.69142836332321167,0.35365915298461914,0.5423576831817627,0.70665228366851807,0.42647704482078552,0.71197021007537842,0.50202709436416626,0.63200736045837402,0.6914592981338501,0.57098853588104248,0.56815105676651001,0.49345478415489197,0.64106667041778564,0.66904920339584351,1.1491043567657471,0.69354462623596191,0.60115092992782593,0.5390934944152832,0.57104557752609253,0.43364199995994568,0.64005172252655029,0.33644941449165344]
[]
[null,null,"Value Added Per Million Dollars Change in Final Demand"]
[null,null,"      Value Added Direct Multipliers","Alabama","Alaska","Arizona","Arkansas","California","Colorado","Connecticut","Delaware","District of Columbia","Florida","Georgia","Hawaii","Idaho","Illinois","Indiana","Iowa","Kansas","Kentucky","Louisiana","Maine","Maryland","Massachusetts","Michigan","Minnesota","Mississippi","Missouri","Montana","MyCounty","MyRegion","Nebraska","Nevada","New Hampshire","New Jersey","New Mexico","New York","North Carolina","North Dakota","Ohio","Oklahoma","Oregon","Pennsylvania","Rhode Island","South Carolina","South Dakota","Tennessee","Texas","United States","Utah","Vermont","Virginia","Washington","West Virginia","Wisconsin","Wyoming"]
[null,null,"Agriculture",0.50424414873123169,0.67526787519454956,0.64396822452545166,0.47738602757453918,0.75849121809005737,0.51432442665100098,0.69389969110488892,0.45536899566650391,0.19533370435237885,0.73229837417602539,0.54175657033920288,0.73451226949691772,0.56518316268920898,0.47667232155799866,0.52342331409454346,0.56665945053100586,0.46271547675132751,0.5524059534072876,0.55842339992523193,0.61361747980117798,0.49721989035606384,0.74297785758972168,0.5746530294418335,0.55140715837478638,0.53215336799621582,0.53555643558502197,0.43729567527770996,{"$f":"'User Add-in Location'!B164","v":0},{"$f":"'User Add-in Location'!C164","v":0},0.46103888750076294,0.58860224485397339,0.60075926780700684,0.74894177913665771,0.5681689977645874,0.59071314334869385,0.61706876754760742,0.46927353739738464,0.54528665542602539,0.53898674249649048,0.66797447204589844,0.56956601142883301,0.6860431432723999,0.5615379810333252,0.48392003774642944,0.54671818017959595,0.52713954448699951,0.5759427547454834,0.59457480907440186,0.57605361938476563,0.55227828025817871,0.70770931243896484,0.52408838272094727,0.53803354501724243,0.53014153242111206]
[null,null,"Mining",0.48979771137237549,0.84158658981323242,0.43124273419380188,0.4699055552482605,0.67735278606414795,0.62411272525787354,0.34601148962974548,0.31959393620491028,0.14347924292087555,0.22117097675800323,0.4328123927116394,0.29262754321098328,0.37038236856460571,0.38636079430580139,0.35808819532394409,0.36369422078132629,0.25686752796173096,0.38286441564559937,0.69897764921188354,6.6726192831993103E-2,0.14967849850654602,0.18429121375083923,0.24203479290008545,0.48182868957519531,0.43047848343849182,0.35874274373054504,0.44427981972694397,{"$f":"'User Add-in Location'!B165","v":0},{"$f":"'User Add-in Location'!C165","v":0},0.37596458196640015,0.53514057397842407,0.33316773176193237,0.29466736316680908,0.60246801376342773,0.25011241436004639,0.44154667854309082,0.69057905673980713,0.38874945044517517,0.55141031742095947,0.24252688884735107,0.5751800537109375,0.25648283958435059,0.31850904226303101,0.28108453750610352,0.40460532903671265,0.72671818733215332,0.62030529975891113,0.55717617273330688,0.46396633982658386,0.38282433152198792,0.32673206925392151,0.42423367500305176,0.49484559893608093,0.67814290523529053]
[null,null,"Construction",0.37553167343139648,0.51874905824661255,0.43433481454849243,0.34442335367202759,0.43802809715270996,0.39802560210227966,0.414131760597229,0.39379024505615234,0.48728728294372559,0.40639245510101318,0.37469714879989624,0.51016062498092651,0.32925111055374146,0.45214009284973145,0.38561004400253296,0.39774155616760254,0.37633466720581055,0.38281214237213135,0.43005487322807312,0.30468118190765381,0.43645495176315308,0.42516887187957764,0.37805160880088806,0.4466434121131897,0.36894333362579346,0.363197922706604,0.36367535591125488,{"$f":"'User Add-in Location'!B166","v":0},{"$f":"'User Add-in Location'!C166","v":0},0.41589957475662231,0.46875208616256714,0.33019822835922241,0.46031272411346436,0.39510858058929443,0.47305101156234741,0.35866385698318481,0.45240575075149536,0.37791028618812561,0.36930108070373535,0.4082091748714447,0.39685112237930298,0.44564151763916016,0.37823575735092163,0.35280954837799072,0.3499806821346283,0.44290107488632202,0.41546076536178589,0.42713969945907593,0.30109208822250366,0.39778441190719604,0.45316210389137268,0.44775894284248352,0.38622736930847168,0.47975653409957886]
[null,null,"Manufacturing",0.23354128003120422,0.17091809213161469,0.2828947901725769,0.22446076571941376,0.31304657459259033,0.29479125142097473,0.34335905313491821,0.21175193786621094,0.36138606071472168,0.27029836177825928,0.28081220388412476,0.16664054989814758,0.19283029437065125,0.27503806352615356,0.28206318616867065,0.22692137956619263,0.19458138942718506,0.23546051979064941,0.22349625825881958,0.21713751554489136,0.34444081783294678,0.34954386949539185,0.26227807998657227,0.27622225880622864,0.18817761540412903,0.24424803256988525,0.16402070224285126,{"$f":"'User Add-in Location'!B167","v":0},{"$f":"'User Add-in Location'!C167","v":0},0.21615272760391235,0.30936625599861145,0.30686444044113159,0.27392417192459106,0.17892944812774658,0.30828157067298889,0.34152054786682129,0.20762717723846436,0.26088845729827881,0.2138439416885376,0.26693433523178101,0.26338651776313782,0.27359682321548462,0.24412515759468079,0.20893937349319458,0.26439735293388367,0.24605011940002441,0.269584059715271,0.25126257538795471,0.1985633373260498,0.34967878460884094,0.30482667684555054,0.2011299729347229,0.26586779952049255,0.13027171790599823]
[null,null,"Fabricated    Metals",0.3334154486656189,0.25926744937896729,0.28524085879325867,0.36087986826896667,0.33153721690177917,0.34243497252464294,0.37593764066696167,0.33703377842903137,0,0.30748486518859863,0.32897704839706421,0.27156558632850647,0.25842329859733582,0.35272407531738281,0.33492976427078247,0.30193632841110229,0.32146477699279785,0.32885268330574036,0.36938807368278503,0.31709447503089905,0.32458120584487915,0.39276406168937683,0.33672195672988892,0.36668401956558228,0.28141385316848755,0.3292711079120636,0.27791374921798706,{"$f":"'User Add-in Location'!B168","v":0},{"$f":"'User Add-in Location'!C168","v":0},0.35012215375900269,0.31956231594085693,0.34912237524986267,0.36216112971305847,0.21639516949653625,0.34369349479675293,0.31300029158592224,0.32501274347305298,0.34923505783081055,0.3835720419883728,0.32062080502510071,0.33293095231056213,0.2599814236164093,0.35180163383483887,0.30876505374908447,0.35241228342056274,0.36300253868103027,0.34463921189308167,0.30795034766197205,0.30435237288475037,0.38878336548805237,0.36855486035346985,0.26275160908699036,0.34251651167869568,0.30570399761199951]
[null,null,"Machinery",0.19938060641288757,0.19998127222061157,0.29544246196746826,0.21752795577049255,0.30251145362854004,0.20516471564769745,0.29549726843833923,0.32128521800041199,5.68656325340271E-2,0.19282262027263641,0.27193588018417358,7.9796187579631805E-2,0.19599002599716187,0.34180209040641785,0.2316608726978302,0.31102955341339111,0.19322606921195984,0.21472352743148804,0.2232418954372406,0.23029355704784393,0.16788119077682495,0.31367993354797363,0.27787035703659058,0.24121341109275818,0.19489863514900208,0.1262073814868927,9.4265803694725037E-2,{"$f":"'User Add-in Location'!B169","v":0},{"$f":"'User Add-in Location'!C169","v":0},0.31564843654632568,0.20809844136238098,0.44761037826538086,0.32838395237922668,0.15247949957847595,0.30127441883087158,0.3431171178817749,0.27394726872444153,0.27780348062515259,0.33325099945068359,0.24773679673671722,0.27396887540817261,0.34547042846679688,0.27743840217590332,0.2148195207118988,0.25295570492744446,0.30720329284667969,0.27470982074737549,0.23079165816307068,0.34185546636581421,0.27974194288253784,0.26457270979881287,0.27954354882240295,0.24629314243793488,0.12977989017963409]
[null,null,"Electrical    Equipment",0.25491926074028015,0,0.32142481207847595,0.26802176237106323,0.40665298700332642,0.29897242784500122,0.3350600004196167,0.36432507634162903,0.57924866676330566,0.29529684782028198,0.28016254305839539,0.28410571813583374,0.32563406229019165,0.35180968046188354,0.36607074737548828,0.2859666645526886,0.35914629697799683,0.2519567608833313,0.35354095697402954,0.34028452634811401,0.30916747450828552,0.36091846227645874,0.24647538363933563,0.24076443910598755,0.18719156086444855,0.46239680051803589,0.1483234167098999,{"$f":"'User Add-in Location'!B170","v":0},{"$f":"'User Add-in Location'!C170","v":0},0.33438414335250854,0.48191541433334351,0.30428919196128845,0.31450337171554565,0.46016871929168701,0.28106766939163208,0.32458078861236572,0.19788344204425812,0.28638860583305359,0.29194074869155884,0.67159843444824219,0.33805370330810547,0.24410334229469299,0.38518643379211426,0.21638785302639008,0.36556684970855713,0.3823811411857605,0.41597437858581543,0.231302410364151,0.18012963235378265,0.27051845192909241,0.31392258405685425,0.20322722196578979,0.25829565525054932,0.18523848056793213]
[null,null,"TCPU",0.34620967507362366,0.57495343685150146,0.4291648268699646,0.40221738815307617,0.43628072738647461,0.44417107105255127,0.45947578549385071,0.36396294832229614,0.45344072580337524,0.42526578903198242,0.40202033519744873,0.40491282939910889,0.38838851451873779,0.40960180759429932,0.37640875577926636,0.40584754943847656,0.41855990886688232,0.36861002445220947,0.37222772836685181,0.44010582566261292,0.41409224271774292,0.41887730360031128,0.39136433601379395,0.39623647928237915,0.36346107721328735,0.4237702488899231,0.40728014707565308,{"$f":"'User Add-in Location'!B171","v":0},{"$f":"'User Add-in Location'!C171","v":0},0.57013750076293945,0,0.41467434167861938,0.48684394359588623,0.39722740650177002,0.40347814559936523,0.42536872625350952,0.45035415887832642,0.46037390828132629,0.46225142478942871,0.46134251356124878,0.43631505966186523,0.43269878625869751,0.36477726697921753,0.37344425916671753,0.36836880445480347,0.47173398733139038,0.4262402355670929,0.39853164553642273,0.36080420017242432,0.43853053450584412,0.45247888565063477,0.32941213250160217,0.41677859425544739,0.45289656519889832]
[null,null,"Wholesale    Trade",0.60554563999176025,0.64818215370178223,0.63109225034713745,0.65155929327011108,0.66214662790298462,0.63339495658874512,0.69715112447738647,0.66305011510848999,0.68592172861099243,0.6419837474822998,0.65342998504638672,0.56086361408233643,0.57618522644042969,0.66077917814254761,0.61169850826263428,0.59965634346008301,0.62831920385360718,0.63288748264312744,0.62805438041687012,0.60804367065429688,0.64604425430297852,0.6615985631942749,0.64317941665649414,0.63386666774749756,0.59467810392379761,0.6143718957901001,0.59131753444671631,{"$f":"'User Add-in Location'!B172","v":0},{"$f":"'User Add-in Location'!C172","v":0},0.60255837440490723,0.6169707179069519,0.63193458318710327,0.68668866157531738,0.56109678745269775,0.67914187908172607,0.61696851253509521,0.64388996362686157,0.62291717529296875,0.61827945709228516,0.61343657970428467,0.653999924659729,0.62838709354400635,0.62759196758270264,0.60625237226486206,0.62950026988983154,0.67355620861053467,0.64731824398040771,0.59583687782287598,0.58076786994934082,0.63570326566696167,0.65410542488098145,0.6070823073387146,0.60228252410888672,0.647422194480896]
[null,null,"Retail    Trade",0.65963315963745117,0.65112537145614624,0.67559123039245605,0.63756126165390015,0.70588147640228271,0.64711141586303711,0.68139100074768066,0.62154793739318848,0.68365055322647095,0.65668529272079468,0.64390319585800171,0.68666952848434448,0.62846821546554565,0.65417653322219849,0.62773513793945313,0.60197991132736206,0.64278435707092285,0.61176472902297974,0.65951991081237793,0.63072043657302856,0.65969967842102051,0.64436084032058716,0.65985262393951416,0.6408926248550415,0.63962066173553467,0.62164402008056641,0.58811318874359131,{"$f":"'User Add-in Location'!B173","v":0},{"$f":"'User Add-in Location'!C173","v":0},0.615226149559021,0.56238925457000732,0.63415038585662842,0.6891406774520874,0.63423556089401245,0.68704748153686523,0.61253350973129272,0.6381416916847229,0.64264094829559326,0.64126467704772949,0.60266512632369995,0.62366414070129395,0.65676510334014893,0.64061206579208374,0.62378942966461182,0.6545225977897644,0.68147575855255127,0.66044485569000244,0.6410142183303833,0.64250493049621582,0.64097046852111816,0.71759647130966187,0.63121145963668823,0.61891579627990723,0.64141154289245605]
[null,null,"FIRE",0.5524289608001709,0.66240429878234863,0.55867129564285278,0.55785298347473145,0.66003161668777466,0.54839754104614258,0.6571662425994873,0.75532293319702148,0.74543642997741699,0.54067468643188477,0.61434733867645264,0.64917272329330444,0.49399596452713013,0.64017629623413086,0.58951836824417114,0.60733747482299805,0.55207067728042603,0.55288171768188477,0.55375254154205322,0.60872584581375122,0.65005290508270264,0.67042583227157593,0.5780491828918457,0.59144353866577148,0.51632797718048096,0.59554684162139893,0.55739229917526245,{"$f":"'User Add-in Location'!B174","v":0},{"$f":"'User Add-in Location'!C174","v":0},0.58114933967590332,0,0.6266171932220459,0.63442015647888184,0.59691101312637329,0.75784540176391602,0.66278839111328125,0.58253145217895508,0.63457369804382324,0.51870805025100708,0.59640014171600342,0.59996426105499268,0.65094953775405884,0.55329352617263794,0.671478271484375,0.59549838304519653,0.53452605009078979,0.62653046846389771,0.57602077722549438,0.61078023910522461,0.63324850797653198,0.63547855615615845,0.59812033176422119,0.59235548973083496,0.53896188735961914]
[null,null,"Misc.    Services",0.56248891353607178,0.60041522979736328,0.58261537551879883,0.51675105094909668,0.65775865316390991,0.60806566476821899,0.63449722528457642,0.66232842206954956,0.74176013469696045,0.60848498344421387,0.61695432662963867,0.56003010272979736,0.52298444509506226,0.66569489240646362,0.60293805599212646,0.53541797399520874,0.55154669284820557,0.54209136962890625,0.59781807661056519,0.53335440158843994,0.61722815036773682,0.64806461334228516,0.58203023672103882,0.60039722919464111,0.51142978668212891,0.58948755264282227,0.52499055862426758,{"$f":"'User Add-in Location'!B175","v":0},{"$f":"'User Add-in Location'!C175","v":0},0.56161707639694214,0.59377634525299072,0.58736574649810791,0.6652679443359375,0.53429555892944336,0.68844622373580933,0.59036791324615479,0.56634658575057983,0.57980036735534668,0.56459736824035645,0.62757670879364014,0.62109744548797607,0.57817089557647705,0.55827724933624268,0.48889338970184326,0.6053537130355835,0.6381537914276123,0.62753182649612427,0.54777050018310547,0.54053163528442383,0.64893233776092529,0.61558818817138672,0.5636633038520813,0.55847287178039551,0.55010432004928589]
[null,null,"Professional    Services",0.58900558948516846,0.61158984899520874,0.5849534273147583,0.6072009801864624,0.63465964794158936,0.61080169677734375,0.6466483473777771,0.63064742088317871,0.66495978832244873,0.59424269199371338,0.57594192028045654,0.60612893104553223,0.55207169055938721,0.61239373683929443,0.58848822116851807,0.58032345771789551,0.58923542499542236,0.57461416721343994,0.59736025333404541,0.57678580284118652,0.61641955375671387,0.63125813007354736,0.59102755784988403,0.60653942823410034,0.55466282367706299,0.57633596658706665,0.54766762256622314,{"$f":"'User Add-in Location'!B176","v":0},{"$f":"'User Add-in Location'!C176","v":0},0.57553982734680176,0.61793732643127441,0.62240517139434814,0.64288473129272461,0.52811747789382935,0.63893020153045654,0.58285176753997803,0.61117637157440186,0.59957665205001831,0.58364391326904297,0.58809256553649902,0.62411212921142578,0.60997462272644043,0.56837409734725952,0.56920206546783447,0.60296785831451416,0.60850584506988525,0.61020302772521973,0.57635533809661865,0.5763782262802124,0.61810564994812012,0.62388217449188232,0.58806294202804565,0.60159611701965332,0.59798872470855713]
[null,null,"Government",0.8935016393661499,0.95501232147216797,0.8529740571975708,0.90414166450500488,0.90993893146514893,0.93557310104370117,0.83973228931427002,0.97945666313171387,0.98790526390075684,0.92020022869110107,0.98344099521636963,0.93834024667739868,0.87505125999450684,0.95574885606765747,0.93621790409088135,0.91048687696456909,0.90349507331848145,0.89974486827850342,0.8674207329750061,0.899169921875,0.97398090362548828,0.96640551090240479,0.92947220802307129,0.85768967866897583,0.91625720262527466,0.91209298372268677,0.89070838689804077,{"$f":"'User Add-in Location'!B177","v":0},{"$f":"'User Add-in Location'!C177","v":0},0.91257363557815552,0.79427987337112427,0.93869590759277344,0.94953101873397827,0.87179303169250488,0.8983534574508667,0.95149195194244385,0.76231139898300171,0.93548816442489624,0.78093266487121582,0.89005374908447266,0.91155409812927246,0.9573286771774292,0.90357136726379395,0.74781596660614014,0.87836706638336182,0.921592116355896,0.91350513696670532,0.93953168392181396,0.95538479089736938,0.92513537406921387,0.84455060958862305,0.89500117301940918,0.88529598712921143,0.89971011877059937]
[]
[null,null,"Value Added Per Million Dollars Change in Final Demand"]
[null,null,"      Value Added Indirect Multipliers","Alabama","Alaska","Arizona","Arkansas","California","Colorado","Connecticut","Delaware","District of Columbia","Florida","Georgia","Hawaii","Idaho","Illinois","Indiana","Iowa","Kansas","Kentucky","Louisiana","Maine","Maryland","Massachusetts","Michigan","Minnesota","Mississippi","Missouri","Montana","MyCounty","MyRegion","Nebraska","Nevada","New Hampshire","New Jersey","New Mexico","New York","North Carolina","North Dakota","Ohio","Oklahoma","Oregon","Pennsylvania","Rhode Island","South Carolina","South Dakota","Tennessee","Texas","United States","Utah","Vermont","Virginia","Washington","West Virginia","Wisconsin","Wyoming"]
[null,null,"Agriculture",0.12529993057250977,6.1280615627765656E-2,0.12165544927120209,0.19459228217601776,0.10777950286865234,0.22438506782054901,6.6406965255737305E-2,0.16234435141086578,9.108985960483551E-2,8.9950293302536011E-2,0.15354025363922119,7.9533442854881287E-2,0.18824398517608643,0.1585298478603363,0.10419490933418274,0.19012102484703064,0.21858732402324677,9.7805216908454895E-2,7.9013392329216003E-2,0.10745741426944733,0.10377562046051025,5.7200402021408081E-2,0.10667949914932251,0.18672230839729309,0.12819354236125946,0.1356099396944046,0.16156961023807526,{"$f":"'User Add-in Location'!B181","v":0},{"$f":"'User Add-in Location'!C181","v":0},0.22786480188369751,5.7097218930721283E-2,8.2749441266059875E-2,5.5616818368434906E-2,0.13638772070407867,0.12158794701099396,0.13305750489234924,0.16397032141685486,0.11975497007369995,0.14038047194480896,0.13228452205657959,0.12487547099590302,5.8309171348810196E-2,8.7258972227573395E-2,0.21356800198554993,0.10279904305934906,0.16416582465171814,0.30601376295089722,0.12673084437847137,0.168182373046875,0.11654742062091827,0.10185271501541138,7.7734053134918213E-2,0.19600945711135864,0.10059686005115509]
[null,null,"Mining",0.11971667408943176,8.8257752358913422E-2,0.16698610782623291,0.14048314094543457,0.14340338110923767,0.17628131806850433,0.17867431044578552,0.15854030847549438,0.15825290977954865,0.2325768768787384,0.15135356783866882,0.15762925148010254,0.13933141529560089,0.18906167149543762,0.14626699686050415,0.13198380172252655,0.21764013171195984,0.13318341970443726,0.14091426134109497,0.20329767465591431,0.20893244445323944,0.2310350239276886,0.194703608751297,0.15170380473136902,0.12800323963165283,0.16042943298816681,0.16646042466163635,{"$f":"'User Add-in Location'!B182","v":0},{"$f":"'User Add-in Location'!C182","v":0},0.14701539278030396,0.10882437974214554,0.16147315502166748,0.20273807644844055,0.18011011183261871,0.21644845604896545,0.14502358436584473,0.13607224822044373,0.18663915991783142,0.21225251257419586,0.19243305921554565,0.15306288003921509,0.18157856166362762,0.13787609338760376,0.15361110866069794,0.14528870582580566,0.17987060546875,0.26303458213806152,0.17461501061916351,0.11577729880809784,0.16179277002811432,0.18874022364616394,0.15745416283607483,0.12299942970275879,0.15148112177848816]
[null,null,"Construction",0.209515780210495,0.16446016728878021,0.23003126680850983,0.21740399301052094,0.30273362994194031,0.2657584547996521,0.2439885288476944,0.21843089163303375,0.1274152547121048,0.26043140888214111,0.25643602013587952,0.17278382182121277,0.22170333564281464,0.2434602677822113,0.21517151594161987,0.19501769542694092,0.22136944532394409,0.19285719096660614,0.18896618485450745,0.24593695998191833,0.20135469734668732,0.23766238987445831,0.24840095639228821,0.24422764778137207,0.18091046810150146,0.23871999979019165,0.19751918315887451,{"$f":"'User Add-in Location'!B183","v":0},{"$f":"'User Add-in Location'!C183","v":0},0.20738755166530609,9.3115553259849548E-2,0.25427445769309998,0.23555628955364227,0.18907184898853302,0.22236791253089905,0.25591126084327698,0.19552803039550781,0.26353961229324341,0.22947397828102112,0.22072829306125641,0.25152602791786194,0.20165202021598816,0.2065446674823761,0.21464133262634277,0.25139260292053223,0.27769100666046143,0.44560521841049194,0.24597042798995972,0.22023412585258484,0.22255054116249084,0.23905330896377563,0.15430408716201782,0.23259754478931427,0.1461462527513504]
[null,null,"Manufacturing",0.15711915493011475,0.23617777228355408,0.188335120677948,0.18802979588508606,0.28333532810211182,0.2511482834815979,0.15777528285980225,0.16222496330738068,8.5650153458118439E-2,0.2035176157951355,0.18845073878765106,0.17803499102592468,0.1869751363992691,0.20701080560684204,0.15080952644348145,0.17275282740592957,0.20364852249622345,0.14888766407966614,0.19976693391799927,0.16431517899036407,0.1367565393447876,0.16731113195419312,0.17979305982589722,0.22092628479003906,0.15257513523101807,0.17814874649047852,0.18645100295543671,{"$f":"'User Add-in Location'!B184","v":0},{"$f":"'User Add-in Location'!C184","v":0},0.18629224598407745,0.11249392479658127,0.14657880365848541,0.18509820103645325,0.21727374196052551,0.1815502941608429,0.17574240267276764,0.2246929407119751,0.20030736923217773,0.23280870914459229,0.19535166025161743,0.21201786398887634,0.14870738983154297,0.13922800123691559,0.17463013529777527,0.16625450551509857,0.32473519444465637,0.49789696931838989,0.22442430257797241,0.16955368220806122,0.14856728911399841,0.19969913363456726,0.13939327001571655,0.19181632995605469,0.21145948767662048]
[null,null,"Fabricated    Metals",0.13513416051864624,0.15444029867649078,0.17968370020389557,0.13234859704971313,0.27560609579086304,0.19985449314117432,0.16647052764892578,0.14137738943099976,0,0.19509020447731018,0.17801186442375183,0.15269026160240173,0.14351001381874084,0.19831377267837524,0.14921486377716064,0.13546192646026611,0.14443939924240112,0.1301218718290329,0.12999376654624939,0.14396063983440399,0.15175212919712067,0.17683336138725281,0.17473462224006653,0.19580461084842682,0.11650402098894119,0.15841972827911377,0.13425734639167786,{"$f":"'User Add-in Location'!B185","v":0},{"$f":"'User Add-in Location'!C185","v":0},0.13753992319107056,0.10301053524017334,0.14855688810348511,0.18044182658195496,0.13933996856212616,0.18346472084522247,0.18852800130844116,0.1425916850566864,0.18658849596977234,0.14187562465667725,0.17208831012248993,0.19116696715354919,0.1685260534286499,0.12731453776359558,0.12925954163074493,0.15645202994346619,0.23757186532020569,0.45557519793510437,0.201038658618927,0.1275477260351181,0.14446635544300079,0.19141167402267456,0.11122974753379822,0.16526684165000916,0.11024912446737289]
[null,null,"Machinery",0.16017754375934601,0.15769201517105103,0.17651599645614624,0.16514924168586731,0.27557191252708435,0.23408955335617065,0.1829649806022644,0.13901194930076599,0.13880264759063721,0.22230798006057739,0.19227908551692963,0.1881902813911438,0.16323372721672058,0.19954471290111542,0.17061801254749298,0.13990610837936401,0.17396353185176849,0.15235278010368347,0.1522543728351593,0.15952354669570923,0.18169468641281128,0.19260653853416443,0.18410713970661163,0.2312847375869751,0.13136805593967438,0.20405347645282745,0.16726472973823547,{"$f":"'User Add-in Location'!B186","v":0},{"$f":"'User Add-in Location'!C186","v":0},0.15187670290470123,0.11605951189994812,0.12548036873340607,0.1852584034204483,0.15030305087566376,0.19104599952697754,0.17662429809570313,0.16983030736446381,0.20213940739631653,0.14938546717166901,0.19320882856845856,0.2004593163728714,0.14697229862213135,0.13912910223007202,0.15887404978275299,0.17672914266586304,0.24411725997924805,0.49094027280807495,0.20832312107086182,0.11751081794500351,0.16336706280708313,0.21329720318317413,0.10814015567302704,0.18945980072021484,0.13981756567955017]
[null,null,"Electrical    Equipment",0.1697705090045929,0,0.24081572890281677,0.17750978469848633,0.32177439332008362,0.25316494703292847,0.2114054411649704,0.15752430260181427,8.2649126648902893E-2,0.25240850448608398,0.21883107721805573,0.17174312472343445,0.18901222944259644,0.2205522358417511,0.15597036480903625,0.1591520756483078,0.15739887952804565,0.16860276460647583,0.1449589729309082,0.16717119514942169,0.18787631392478943,0.25802320241928101,0.21685802936553955,0.26878020167350769,0.153851717710495,0.15598148107528687,0.18541741371154785,{"$f":"'User Add-in Location'!B187","v":0},{"$f":"'User Add-in Location'!C187","v":0},0.16558095812797546,9.7940690815448761E-2,0.20037609338760376,0.23022250831127167,0.14211288094520569,0.24826900660991669,0.21846216917037964,0.20425613224506378,0.22221724689006805,0.18170543015003204,0.1324927806854248,0.21243402361869812,0.21210008859634399,0.14020290970802307,0.17874658107757568,0.17559601366519928,0.2694733738899231,0.42931723594665527,0.24733123183250427,0.20201584696769714,0.20509584248065948,0.22796621918678284,0.14996384084224701,0.205778568983078,0.15409936010837555]
[null,null,"TCPU",0.22548338770866394,0.21171824634075165,0.24186450242996216,0.21986421942710876,0.28118002414703369,0.28144851326942444,0.22144277393817902,0.22130909562110901,0.16121602058410645,0.25559812784194946,0.24639934301376343,0.20086468756198883,0.20305162668228149,0.26781195402145386,0.21608081459999084,0.20311632752418518,0.20680850744247437,0.20326444506645203,0.25417023897171021,0.20167230069637299,0.21824470162391663,0.23942092061042786,0.23238304257392883,0.27686053514480591,0.20085591077804565,0.23177595436573029,0.22302693128585815,{"$f":"'User Add-in Location'!B188","v":0},{"$f":"'User Add-in Location'!C188","v":0},0.16682900488376617,0,0.20975956320762634,0.22349090874195099,0.23528151214122772,0.26014289259910583,0.22357645630836487,0.24762856960296631,0.23689532279968262,0.25402775406837463,0.21714858710765839,0.2500496506690979,0.20830778777599335,0.19604070484638214,0.21024137735366821,0.23481419682502747,0.31833934783935547,0.436012864112854,0.27364534139633179,0.21773387491703033,0.22079390287399292,0.23011757433414459,0.20399826765060425,0.22222068905830383,0.22425191104412079]
[null,null,"Wholesale    Trade",0.19202694296836853,0.17898157238960266,0.23678073287010193,0.17400640249252319,0.25772756338119507,0.25189575552940369,0.21281921863555908,0.21176314353942871,0.18339213728904724,0.24641311168670654,0.22207619249820709,0.23972237110137939,0.20535020530223846,0.24087324738502502,0.19975537061691284,0.20113497972488403,0.19620352983474731,0.17530076205730438,0.17622648179531097,0.21899870038032532,0.22055304050445557,0.24636274576187134,0.20784488320350647,0.24453306198120117,0.16729669272899628,0.23327142000198364,0.19102095067501068,{"$f":"'User Add-in Location'!B189","v":0},{"$f":"'User Add-in Location'!C189","v":0},0.21932248771190643,0.15974102914333344,0.23033908009529114,0.22219040989875793,0.2010556161403656,0.23418229818344116,0.23612014949321747,0.18206979334354401,0.23978756368160248,0.19819240272045135,0.22957903146743774,0.22587153315544128,0.24812284111976624,0.18413135409355164,0.20184186100959778,0.21817076206207275,0.21259455382823944,0.31006136536598206,0.26086899638175964,0.21852827072143555,0.21882063150405884,0.22130215167999268,0.16692128777503967,0.23167182505130768,0.14099818468093872]
[null,null,"Retail    Trade",0.1669919341802597,0.18272820115089417,0.21099153161048889,0.18056252598762512,0.21953915059566498,0.24153411388397217,0.22341424226760864,0.24554291367530823,0.18916831910610199,0.2364039272069931,0.22877907752990723,0.17498186230659485,0.18207019567489624,0.24642518162727356,0.1912805587053299,0.20876212418079376,0.18851840496063232,0.18463899195194244,0.1606820821762085,0.20959071815013885,0.21124051511287689,0.25553134083747864,0.19593606889247894,0.24184471368789673,0.15135607123374939,0.22908708453178406,0.19680874049663544,{"$f":"'User Add-in Location'!B190","v":0},{"$f":"'User Add-in Location'!C190","v":0},0.21839508414268494,0.13673722743988037,0.22849801182746887,0.21924318373203278,0.16922442615032196,0.22950339317321777,0.23910386860370636,0.18893119692802429,0.22995424270629883,0.18825694918632507,0.23545731604099274,0.24367576837539673,0.23133306205272675,0.1762644499540329,0.19974407553672791,0.2011813223361969,0.20889949798583984,0.30034208297729492,0.23507612943649292,0.18923595547676086,0.21590763330459595,0.1788727194070816,0.1546071469783783,0.22415585815906525,0.14913037419319153]
[null,null,"FIRE",0.22816082835197449,0.18154752254486084,0.30609267950057983,0.21507048606872559,0.26054501533508301,0.32182192802429199,0.25811272859573364,0.18416544795036316,0.17148098349571228,0.33111861348152161,0.2584957480430603,0.207275390625,0.25939595699310303,0.27489173412322998,0.2158944308757782,0.22601008415222168,0.24231785535812378,0.21419093012809753,0.21075364947319031,0.23498961329460144,0.23016895353794098,0.25607272982597351,0.2487027496099472,0.28927809000015259,0.2044176459312439,0.25204992294311523,0.21980856359004974,{"$f":"'User Add-in Location'!B191","v":0},{"$f":"'User Add-in Location'!C191","v":0},0.25150305032730103,0,0.25160032510757446,0.27445822954177856,0.19502931833267212,0.19369389116764069,0.22027045488357544,0.22550635039806366,0.2484239786863327,0.25190448760986328,0.24736320972442627,0.27011007070541382,0.25975292921066284,0.22499431669712067,0.18944311141967773,0.23897695541381836,0.31329327821731567,0.3381323516368866,0.29881191253662109,0.21846766769886017,0.23096776008605957,0.23672989010810852,0.16922849416732788,0.25122672319412231,0.20317700505256653]
[null,null,"Misc.    Services",0.2142905592918396,0.19729313254356384,0.2654564380645752,0.21852518618106842,0.2679065465927124,0.27639561891555786,0.26412650942802429,0.23093149065971375,0.15840770304203033,0.27046093344688416,0.24379062652587891,0.22266747057437897,0.22714880108833313,0.2467280775308609,0.20452739298343658,0.22367793321609497,0.2326761782169342,0.20486548542976379,0.18695299327373505,0.25680744647979736,0.24536210298538208,0.27282211184501648,0.24896757304668427,0.2677304744720459,0.18731436133384705,0.24563288688659668,0.2130391001701355,{"$f":"'User Add-in Location'!B192","v":0},{"$f":"'User Add-in Location'!C192","v":0},0.23447036743164063,0.1596372127532959,0.26205277442932129,0.24823774397373199,0.2149939239025116,0.23767921328544617,0.25461193919181824,0.20072135329246521,0.26764756441116333,0.21476155519485474,0.22172233462333679,0.25489810109138489,0.28432133793830872,0.21579650044441223,0.24211561679840088,0.22912755608558655,0.23483432829380035,0.33261168003082275,0.29730725288391113,0.24593102931976318,0.21594530344009399,0.25189292430877686,0.18231669068336487,0.25210511684417725,0.16672725975513458]
[null,null,"Professional    Services",0.1805867999792099,0.17992712557315826,0.24057823419570923,0.17264634370803833,0.25660115480422974,0.24153983592987061,0.22237907350063324,0.21411827206611633,0.17656992375850677,0.25095078349113464,0.24367813766002655,0.19432860612869263,0.19628050923347473,0.24955534934997559,0.19110897183418274,0.19200527667999268,0.19482740759849548,0.1798931360244751,0.17230935394763947,0.2124573290348053,0.21377110481262207,0.24239002168178558,0.21453279256820679,0.23820848762989044,0.16474077105522156,0.22831250727176666,0.18978454172611237,{"$f":"'User Add-in Location'!B193","v":0},{"$f":"'User Add-in Location'!C193","v":0},0.21097622811794281,0.13135994970798492,0.21082554757595062,0.22773063182830811,0.19698368012905121,0.23796926438808441,0.23283834755420685,0.17659576237201691,0.23095786571502686,0.19299674034118652,0.22132144868373871,0.2208678275346756,0.23328006267547607,0.19046491384506226,0.19785231351852417,0.20794232189655304,0.23569118976593018,0.32952982187271118,0.25005465745925903,0.19979643821716309,0.20611245930194855,0.21784844994544983,0.15509356558322906,0.20920222997665405,0.14537005126476288]
[null,null,"Government",4.8029236495494843E-2,2.3375576362013817E-2,8.26534703373909E-2,4.1748635470867157E-2,6.0573060065507889E-2,3.9708215743303299E-2,9.4589978456497192E-2,1.1564560234546661E-2,5.4864408448338509E-3,4.7353431582450867E-2,9.1010583564639091E-3,3.0645154416561127E-2,5.4562788456678391E-2,2.7573063969612122E-2,2.9885940253734589E-2,4.1161928325891495E-2,4.5549303293228149E-2,4.2536981403827667E-2,6.2863484025001526E-2,4.8443496227264404E-2,1.4101957902312279E-2,2.0891739055514336E-2,3.644871711730957E-2,8.4017202258110046E-2,3.262045606970787E-2,4.5423842966556549E-2,4.7970116138458252E-2,{"$f":"'User Add-in Location'!B194","v":0},{"$f":"'User Add-in Location'!C194","v":0},4.2933396995067596E-2,7.4300765991210938E-2,3.2624900341033936E-2,3.1202804297208786E-2,5.7368472218513489E-2,6.3761189579963684E-2,2.616201713681221E-2,0.11672781407833099,3.6225751042366028E-2,0.10528822243213654,5.7562779635190964E-2,5.1085822284221649E-2,2.4326996877789497E-2,4.3040547519922256E-2,0.11251601576805115,6.1395797878503799E-2,4.9996465444564819E-2,7.2108082473278046E-2,3.5774998366832733E-2,2.0362261682748795E-2,3.949245810508728E-2,8.8303990662097931E-2,4.272085428237915E-2,5.8546911925077438E-2,4.3598778545856476E-2]
[]
[null,null,"Value Added Per Million Dollars Change in Final Demand"]
[null,null,"      Value Added Induced Multipliers","Alabama","Alaska","Arizona","Arkansas","California","Colorado","Connecticut","Delaware","District of Columbia","Florida","Georgia","Hawaii","Idaho","Illinois","Indiana","Iowa","Kansas","Kentucky","Louisiana","Maine","Maryland","Massachusetts","Michigan","Minnesota","Mississippi","Missouri","Montana","MyCounty","MyRegion","Nebraska","Nevada","New Hampshire","New Jersey","New Mexico","New York","North Carolina","North Dakota","Ohio","Oklahoma","Oregon","Pennsylvania","Rhode Island","South Carolina","South Dakota","Tennessee","Texas","United States","Utah","Vermont","Virginia","Washington","West Virginia","Wisconsin","Wyoming"]
[null,null,"Agriculture",0.14695435762405396,0.16943886876106262,0.18105100095272064,0.14487454295158386,0.26994284987449646,0.16603229939937592,0.14563965797424316,0.11072543263435364,6.4209051430225372E-2,0.23831698298454285,0.26043608784675598,0.2157314121723175,0.18045321106910706,0.32660102844238281,0.18473188579082489,0.13851013779640198,0.14179308712482452,0.13814008235931396,0.16786813735961914,0.20191450417041779,0.13715046644210815,0.21960234642028809,0.16758643090724945,0.18470826745033264,0.14631187915802002,0.16454800963401794,0.10081103444099426,{"$f":"'User Add-in Location'!B198","v":0},{"$f":"'User Add-in Location'!C198","v":0},0.15127605199813843,8.6415231227874756E-2,0.15945011377334595,0.25877481698989868,0.17640462517738342,0.16914528608322144,0.16778117418289185,8.4409996867179871E-2,0.17343774437904358,8.5451267659664154E-2,0.21677696704864502,0.14380864799022675,0.16873331367969513,0.14405053853988647,0.16248989105224609,0.13580590486526489,0.13848882913589478,0.3815481960773468,0.10973027348518372,0.12792181968688965,0.10706318914890289,0.24610725045204163,3.3323846757411957E-2,0.17689085006713867,5.7256162166595459E-2]
[null,null,"Mining",7.8433960676193237E-2,6.1663798987865448E-2,0.1327979564666748,0.1095079630613327,0.15033340454101563,0.23160001635551453,0.15162217617034912,0.22407770156860352,5.8202415704727173E-2,0.12622272968292236,0.16248878836631775,0.10029493272304535,0.10548043251037598,0.14187967777252197,0.1256122887134552,9.3402981758117676E-2,0.1657136082649231,8.4711678326129913E-2,0.10700459778308868,0.1032421737909317,0.11847352981567383,0.20378664135932922,0.16185945272445679,0.15239980816841125,0.12186983227729797,0.12287691235542297,0.12275309860706329,{"$f":"'User Add-in Location'!B199","v":0},{"$f":"'User Add-in Location'!C199","v":0},0.12047609686851501,7.8907698392868042E-2,0.12519560754299164,0.25017547607421875,0.10522814095020294,0.22754365205764771,8.6988337337970734E-2,0.11212918162345886,0.16855683922767639,0.1829720139503479,0.12692247331142426,0.15615877509117126,0.15633842349052429,8.1388503313064575E-2,9.4575636088848114E-2,0.11121787130832672,0.1845647394657135,0.31732410192489624,0.15734779834747314,8.3823308348655701E-2,0.14903567731380463,0.10551354289054871,8.7612316012382507E-2,0.12032873928546906,5.9132523834705353E-2]
[null,null,"Construction",0.16257657110691071,0.16704371571540833,0.22802995145320892,0.14967960119247437,0.27098053693771362,0.25204044580459595,0.24717892706394196,0.19866189360618591,7.2618894279003143E-2,0.2213599681854248,0.21921439468860626,0.18222944438457489,0.14605782926082611,0.2560582160949707,0.18161551654338837,0.16811162233352661,0.17418672144412994,0.14944685995578766,0.15973417460918427,0.18960605561733246,0.22205621004104614,0.25230973958969116,0.2140694260597229,0.24296630918979645,0.12313041090965271,0.22124725580215454,0.14108279347419739,{"$f":"'User Add-in Location'!B200","v":0},{"$f":"'User Add-in Location'!C200","v":0},0.17989438772201538,0.11059741675853729,0.2507021427154541,0.26017209887504578,0.13379308581352234,0.21110877394676208,0.20886756479740143,0.15644645690917969,0.24335449934005737,0.17680607736110687,0.21185225248336792,0.2565651535987854,0.21215522289276123,0.15359827876091003,0.15623551607131958,0.23573300242424011,0.23880094289779663,0.45922544598579407,0.2293158620595932,0.17530959844589233,0.20147646963596344,0.22143658995628357,0.13925594091415405,0.21225887537002563,9.3145817518234253E-2]
[null,null,"Manufacturing",8.1522606313228607E-2,7.0284187793731689E-2,0.15731252729892731,8.6900874972343445E-2,0.18117055296897888,0.16751626133918762,0.15976837277412415,9.1654360294342041E-2,4.4238001108169556E-2,0.15497776865959167,0.13313961029052734,8.4594748914241791E-2,8.4904685616493225E-2,0.15372282266616821,9.0179532766342163E-2,9.1747552156448364E-2,0.10210518538951874,7.5048789381980896E-2,5.7841651141643524E-2,0.1202458068728447,0.12041112780570984,0.1592496931552887,0.12355758249759674,0.16350483894348145,6.471000611782074E-2,0.11688853800296783,5.9632215648889542E-2,{"$f":"'User Add-in Location'!B201","v":0},{"$f":"'User Add-in Location'!C201","v":0},9.1828584671020508E-2,7.2802118957042694E-2,0.1550537645816803,0.14574505388736725,7.041187584400177E-2,0.12685345113277435,0.11197657883167267,7.0760868489742279E-2,0.1345667839050293,0.10587819665670395,0.12958580255508423,0.14398464560508728,0.14315801858901978,8.6021214723587036E-2,9.2863574624061584E-2,0.11468271911144257,0.12798884510993958,0.33422034978866577,0.12793120741844177,0.10424187779426575,0.10824432224035263,0.1249823123216629,6.4569368958473206E-2,0.13311314582824707,3.4487508237361908E-2]
[null,null,"Fabricated    Metals",0.1189974844455719,0.12072815001010895,0.19649821519851685,0.11577810347080231,0.23826588690280914,0.19340534508228302,0.19781205058097839,0.15288297832012177,0,0.19886726140975952,0.17569643259048462,0.14069116115570068,0.11843212693929672,0.22236503660678864,0.13514021039009094,0.12553201615810394,0.12918630242347717,0.1286541223526001,0.12093009054660797,0.15132486820220947,0.16935563087463379,0.20804065465927124,0.18749329447746277,0.2272801399230957,9.8223000764846802E-2,0.17477104067802429,0.11418352276086807,{"$f":"'User Add-in Location'!B202","v":0},{"$f":"'User Add-in Location'!C202","v":0},0.12962788343429565,9.1966971755027771E-2,0.18185937404632568,0.21883267164230347,9.5167055726051331E-2,0.17485085129737854,0.16687579452991486,0.10584381222724915,0.20021483302116394,0.13757088780403137,0.16945961117744446,0.20293334126472473,0.1871519535779953,0.13330209255218506,0.10766041278839111,0.18456891179084778,0.19295340776443481,0.42291057109832764,0.18027177453041077,0.14503777027130127,0.17442256212234497,0.17417925596237183,9.7787395119667053E-2,0.18092307448387146,6.6132910549640656E-2]
[null,null,"Machinery",8.3106324076652527E-2,7.8020989894866943E-2,0.13944205641746521,8.7123341858386993E-2,0.19663506746292114,0.14978982508182526,0.16307759284973145,0.13431957364082336,4.6421945095062256E-2,0.15704450011253357,0.13171309232711792,9.3449778854846954E-2,7.9058989882469177E-2,0.15271472930908203,9.6419759094715118E-2,8.2246601581573486E-2,9.4585120677947998E-2,9.2123046517372131E-2,8.7507441639900208E-2,0.13477215170860291,0.1103978157043457,0.18634095788002014,0.15367132425308228,0.17233195900917053,5.5534705519676208E-2,0.11145585030317307,6.4428478479385376E-2,{"$f":"'User Add-in Location'!B203","v":0},{"$f":"'User Add-in Location'!C203","v":0},8.0035075545310974E-2,7.1133419871330261E-2,0.22931438684463501,0.19306221604347229,6.8794697523117065E-2,0.13655433058738708,0.12836045026779175,6.6634923219680786E-2,0.1650892049074173,0.1101495623588562,0.13442492485046387,0.16078823804855347,0.16502627730369568,0.10648268461227417,7.7301532030105591E-2,0.12076391279697418,0.14993488788604736,0.35288766026496887,0.12986388802528381,0.14366638660430908,0.1343538761138916,0.14818671345710754,0.10098955035209656,0.12106388807296753,4.4484950602054596E-2]
[null,null,"Electrical    Equipment",0.1262056827545166,0,0.17465542256832123,0.10894099622964859,0.22592216730117798,0.16214773058891296,0.16870647668838501,0.15537196397781372,2.8163693845272064E-2,0.17269238829612732,0.14244638383388519,7.1968674659729004E-2,0.11194542795419693,0.19765865802764893,0.13070425391197205,0.10937447845935822,0.1207892894744873,0.11965151131153107,0.11250635236501694,0.10927410423755646,0.14522884786128998,0.17233827710151672,0.1760002076625824,0.18574249744415283,7.345397025346756E-2,0.14442156255245209,7.0093460381031036E-2,{"$f":"'User Add-in Location'!B204","v":0},{"$f":"'User Add-in Location'!C204","v":0},0.13555854558944702,8.0313503742218018E-2,0.17763659358024597,0.18394559621810913,7.2657935321331024E-2,0.14708638191223145,0.12781661748886108,9.3613207340240479E-2,0.16665294766426086,0.12579023838043213,7.4217334389686584E-2,0.17227709293365479,0.12242299318313599,0.1358429342508316,9.896579384803772E-2,0.15620464086532593,0.15591564774513245,0.33136153221130371,0.14119255542755127,0.11856444180011749,0.1373666375875473,0.12766106426715851,7.2755143046379089E-2,0.16460694372653961,5.4728493094444275E-2]
[null,null,"TCPU",0.12244455516338348,7.7028974890708923E-2,0.18282629549503326,0.13810797035694122,0.2366940975189209,0.22259064018726349,0.17948919534683228,0.15458545088768005,7.3116473853588104E-2,0.17954769730567932,0.18867510557174683,0.11996394395828247,0.12720641493797302,0.23326484858989716,0.14502677321434021,0.12857341766357422,0.13525965809822083,0.1224360466003418,0.12188777327537537,0.14838993549346924,0.15428227186203003,0.19519272446632385,0.17504501342773438,0.20915353298187256,9.871239960193634E-2,0.17297154664993286,0.12182376533746719,{"$f":"'User Add-in Location'!B205","v":0},{"$f":"'User Add-in Location'!C205","v":0},0.15029652416706085,0,0.1638035923242569,0.20488539338111877,0.11018084734678268,0.19035106897354126,0.1670747697353363,0.12607601284980774,0.18535631895065308,0.16748163104057312,0.15603232383728027,0.21851646900177002,0.17143933475017548,0.11642298102378845,0.12414008378982544,0.18322731554508209,0.21948538720607758,0.3887825608253479,0.20951174199581146,0.14364920556545258,0.1716325581073761,0.16960299015045166,0.1160653829574585,0.17095714807510376,7.4679024517536163E-2]
[null,null,"Wholesale    Trade",0.16844363510608673,0.12579163908958435,0.2669370174407959,0.15119434893131256,0.26744905114173889,0.28615888953208923,0.2412574291229248,0.21470242738723755,8.1826590001583099E-2,0.26127925515174866,0.24686667323112488,0.18395550549030304,0.16453522443771362,0.28073534369468689,0.18622224032878876,0.1772303581237793,0.18031129240989685,0.15232174098491669,0.15615320205688477,0.20788873732089996,0.22185179591178894,0.28214854001998901,0.23209723830223083,0.29292041063308716,0.12728601694107056,0.23551227152347565,0.15369859337806702,{"$f":"'User Add-in Location'!B206","v":0},{"$f":"'User Add-in Location'!C206","v":0},0.18483993411064148,0.13044717907905579,0.27284738421440125,0.26156610250473022,0.1348457932472229,0.22205862402915955,0.24177670478820801,0.14413057267665863,0.25450694561004639,0.1653047502040863,0.2242855578660965,0.25824952125549316,0.25258743762969971,0.1678411066532135,0.16502952575683594,0.22506323456764221,0.2334398627281189,0.42678913474082947,0.24624495208263397,0.18403229117393494,0.22797578573226929,0.21922573447227478,0.13756769895553589,0.2278468906879425,9.4206169247627258E-2]
[null,null,"Retail    Trade",0.18322959542274475,0.1935962438583374,0.28919330239295959,0.19330579042434692,0.29936426877975464,0.29819521307945251,0.29025518894195557,0.2481377124786377,8.308236300945282E-2,0.29952752590179443,0.27828839421272278,0.19907131791114807,0.19359377026557922,0.30369925498962402,0.20657289028167725,0.19845327734947205,0.19119261205196381,0.20042237639427185,0.17707586288452148,0.24060943722724915,0.24757009744644165,0.31660875678062439,0.24356311559677124,0.29411202669143677,0.15413376688957214,0.26232796907424927,0.20605580508708954,{"$f":"'User Add-in Location'!B207","v":0},{"$f":"'User Add-in Location'!C207","v":0},0.20257177948951721,9.4952374696731567E-2,0.31198281049728394,0.30135923624038696,0.17272880673408508,0.25987595319747925,0.28297960758209229,0.16560935974121094,0.27685573697090149,0.20967796444892883,0.27858299016952515,0.29869264364242554,0.29020065069198608,0.19780559837818146,0.19029408693313599,0.26642835140228271,0.25569832324981689,0.4726460874080658,0.27738338708877563,0.22360220551490784,0.24141544103622437,0.23678570985794067,0.16537380218505859,0.24303413927555084,0.11469757556915283]
[null,null,"FIRE",0.13705578446388245,0.10882732272148132,0.21825411915779114,0.11841282248497009,0.21157951653003693,0.21461197733879089,0.22984540462493896,0.1252131462097168,5.8372329920530319E-2,0.21680405735969543,0.18723976612091064,0.12715476751327515,0.11615265905857086,0.21894222497940063,0.12887722253799438,0.13168257474899292,0.14349478483200073,0.132630854845047,0.12029866874217987,0.15303343534469604,0.15897254645824432,0.24070978164672852,0.1738518625497818,0.24756315350532532,0.10091674327850342,0.17410552501678467,0.10854503512382507,{"$f":"'User Add-in Location'!B208","v":0},{"$f":"'User Add-in Location'!C208","v":0},0.13978962600231171,0,0.19272890686988831,0.20593631267547607,8.5925914347171783E-2,0.20534645020961761,0.20497044920921326,0.11331944167613983,0.182545006275177,0.1380593329668045,0.14677324891090393,0.20831441879272461,0.20339956879615784,0.15305124223232269,0.11477618664503098,0.18942934274673462,0.21132567524909973,0.35200566053390503,0.16466799378395081,0.13362830877304077,0.16015130281448364,0.15269632637500763,0.10031692683696747,0.15876516699790955,6.5812379121780396E-2]
[null,null,"Misc.    Services",0.23944258689880371,0.22477257251739502,0.36533847451210022,0.22180438041687012,0.39479988813400269,0.37909385561943054,0.34569558501243591,0.28201135993003845,0.11104565858840942,0.36904668807983398,0.35126972198486328,0.24790924787521362,0.21149048209190369,0.38862302899360657,0.21730071306228638,0.22205619513988495,0.24877393245697021,0.22665989398956299,0.22945226728916168,0.28321459889411926,0.30500665307044983,0.36056554317474365,0.32985728979110718,0.37004131078720093,0.1780647486448288,0.30986407399177551,0.21018531918525696,{"$f":"'User Add-in Location'!B209","v":0},{"$f":"'User Add-in Location'!C209","v":0},0.23535320162773132,0.18877774477005005,0.32513988018035889,0.36760470271110535,0.19264319539070129,0.31479650735855103,0.30204015970230103,0.19871944189071655,0.34483301639556885,0.23850095272064209,0.25826567411422729,0.34744587540626526,0.32612553238868713,0.24631315469741821,0.20514389872550964,0.31596589088439941,0.3372921347618103,0.5853760838508606,0.32645571231842041,0.24780189990997314,0.32614004611968994,0.29990094900131226,0.19210396707057953,0.29114943742752075,0.13535124063491821]
[null,null,"Professional    Services",0.17559882998466492,0.16427381336688995,0.27977609634399414,0.16360071301460266,0.29922479391098022,0.27801424264907837,0.26982057094573975,0.23269391059875488,9.3799740076065063E-2,0.28070777654647827,0.25561428070068359,0.20017318427562714,0.1719212532043457,0.29516905546188354,0.19727863371372223,0.17515335977077484,0.18559050559997559,0.17944799363613129,0.16586896777153015,0.22994667291641235,0.23613294959068298,0.29645818471908569,0.24805867671966553,0.29294490814208984,0.13643406331539154,0.24229484796524048,0.16404804587364197,{"$f":"'User Add-in Location'!B210","v":0},{"$f":"'User Add-in Location'!C210","v":0},0.19590362906455994,0.1345323920249939,0.26585739850997925,0.28700342774391174,0.14261801540851593,0.24927634000778198,0.2507987916469574,0.14686715602874756,0.27493274211883545,0.17788287997245789,0.23982656002044678,0.28656750917434692,0.26864704489707947,0.17861588299274445,0.17575070261955261,0.25990617275238037,0.24833749234676361,0.46402466297149658,0.24505871534347534,0.20115607976913452,0.24201744794845581,0.22739467024803162,0.15761019289493561,0.23184025287628174,9.660552442073822E-2]
[null,null,"Government",0.26787382364273071,0.29362332820892334,0.39252197742462158,0.31059432029724121,0.43444430828094482,0.4322318434715271,0.34698507189750671,0.32032841444015503,0.10087834298610687,0.42370465397834778,0.43069547414779663,0.33155107498168945,0.28975456953048706,0.46909219026565552,0.34102591872215271,0.30507534742355347,0.32388490438461304,0.30099552869796753,0.29566746950149536,0.37814748287200928,0.31128406524658203,0.32734116911888123,0.39598220586776733,0.41615670919418335,0.2570030689239502,0.39250025153160095,0.27951464056968689,{"$f":"'User Add-in Location'!B211","v":0},{"$f":"'User Add-in Location'!C211","v":0},0.33972865343093872,0.22266954183578491,0.32848796248435974,0.43586766719818115,0.19164001941680908,0.35251247882843018,0.41328397393226624,0.25104540586471558,0.41516733169555664,0.27969753742218018,0.36531925201416016,0.41158196330070496,0.3513648509979248,0.3171379566192627,0.28437519073486328,0.37394672632217407,0.3807947039604187,0.63461416959762573,0.38695052266120911,0.34267514944076538,0.32990694046020508,0.34728878736495972,0.25022810697555542,0.36853808164596558,0.19265486299991608]
[]
[null,null,{"$f":"CONCATENATE(\"Source:  IMPLAN™, using \",D2,\" state data.\")","v":"Source:  IMPLAN™, using 2014 state data."}]
[]
[]
[null,null,"State Specific Multipliers"]
[null,null,null,"Jobs Per Million Dollars Change in Final Demand",null,null,null,"Earnings Per Million Dollars Change in Final Demand",null,null,null,"Output Per Million Dollars Change in Final Demand",null,null,null,"Output Per Million Dollars Change in Final Demand"]
[null,null,null,"Direct","Indirect","Induced","Total","Direct","Indirect","Induced","Total","Direct","Indirect","Induced","Total","Direct","Indirect","Induced","Total",null,"PCE"]
[null,2,"Agriculture",{"$f":"HLOOKUP(Calculations!$E$1,Multipliers!$D$4:$BE$18,$B213)","v":6.4064739508622397},{"$f":"HLOOKUP(Calculations!$E$1,Multipliers!$D$21:$BE$35,B213)","v":0.78346690047577694},{"$f":"HLOOKUP(Calculations!$E$1,Multipliers!$D$38:$BE$52,$B213)","v":2.3698010044588287},{"$f":"SUM(D213:F213)","v":9.5597418557968457},{"$f":"HLOOKUP(Calculations!E$1,Multipliers!$D$55:$BE$69,B213)","v":0.43417537212371826},{"$f":"HLOOKUP(Calculations!$E$1,Multipliers!$D$72:$BE$86,$B213)","v":5.9046462178230286E-2},{"$f":"HLOOKUP(Calculations!$E$1,Multipliers!$D$89:$BE$103,$B213)","v":0.15616044402122498},{"$f":"SUM(H213:J213)","v":0.64938227832317352},{"$f":"HLOOKUP(Calculations!E$1,Multipliers!$D$106:$BE$120,B213)","v":1},{"$f":"HLOOKUP(Calculations!$E$1,Multipliers!$D$123:$BE$137,$B213)","v":0.18266880512237549},{"$f":"HLOOKUP(Calculations!$E$1,Multipliers!$D$140:$BE$154,$B213)","v":0.43952274322509766},{"$f":"SUM(L213:N213)","v":1.6221915483474731},{"$f":"HLOOKUP(Calculations!$E$1,Multipliers!$D$157:$BE$171,$B213)","v":0.75849121809005737},{"$f":"HLOOKUP(Calculations!$E$1,Multipliers!$D$174:$BE$188,$B213)","v":0.10777950286865234},{"$f":"HLOOKUP(Calculations!$E$1,Multipliers!$D$191:$BE$205,$B213)","v":0.26994284987449646},{"$f":"SUM(P213:R213)","v":1.1362135708332062},null,{"$f":"HLOOKUP(Calculations!$E$1,'Household Exp'!$D$3:$BE$17,$B213)","v":3.9792492388490055E-3}]
[null,3,"Mining",{"$f":"HLOOKUP(Calculations!$E$1,Multipliers!$D$4:$BE$18,$B214)","v":1.9009331827578337},{"$f":"HLOOKUP(Calculations!$E$1,Multipliers!$D$21:$BE$35,B214)","v":1.0656654247339221},{"$f":"HLOOKUP(Calculations!$E$1,Multipliers!$D$38:$BE$52,$B214)","v":1.5157225857610288},4.4823211932527851,{"$f":"HLOOKUP(Calculations!E$1,Multipliers!$D$55:$BE$69,B214)","v":0.19753266870975494},{"$f":"HLOOKUP(Calculations!$E$1,Multipliers!$D$72:$BE$86,$B214)","v":7.5320951640605927E-2},{"$f":"HLOOKUP(Calculations!$E$1,Multipliers!$D$89:$BE$103,$B214)","v":8.6955055594444275E-2},0.35980867594480515,{"$f":"HLOOKUP(Calculations!E$1,Multipliers!$D$106:$BE$120,B214)","v":1},{"$f":"HLOOKUP(Calculations!$E$1,Multipliers!$D$123:$BE$137,$B214)","v":0.24997413158416748},{"$f":"HLOOKUP(Calculations!$E$1,Multipliers!$D$140:$BE$154,$B214)","v":0.24479267001152039},1.4947668015956879,{"$f":"HLOOKUP(Calculations!$E$1,Multipliers!$D$157:$BE$171,$B214)","v":0.67735278606414795},{"$f":"HLOOKUP(Calculations!$E$1,Multipliers!$D$174:$BE$188,$B214)","v":0.14340338110923767},{"$f":"HLOOKUP(Calculations!$E$1,Multipliers!$D$191:$BE$205,$B214)","v":0.15033340454101563},{"$f":"SUM(P214:R214)","v":0.97108957171440125},null,{"$f":"HLOOKUP(Calculations!$E$1,'Household Exp'!$D$3:$BE$17,$B214)","v":7.6359916951794383E-6}]
[null,4,"Construction",{"$f":"HLOOKUP(Calculations!$E$1,Multipliers!$D$4:$BE$18,$B215)","v":5.2907700337789363},{"$f":"HLOOKUP(Calculations!$E$1,Multipliers!$D$21:$BE$35,B215)","v":2.9360729408600177},{"$f":"HLOOKUP(Calculations!$E$1,Multipliers!$D$38:$BE$52,$B215)","v":2.6419363354048158},10.86877931004377,{"$f":"HLOOKUP(Calculations!E$1,Multipliers!$D$55:$BE$69,B215)","v":0.31438863277435303},{"$f":"HLOOKUP(Calculations!$E$1,Multipliers!$D$72:$BE$86,$B215)","v":0.17574077844619751},{"$f":"HLOOKUP(Calculations!$E$1,Multipliers!$D$89:$BE$103,$B215)","v":0.15672792494297028},0.64685733616352081,{"$f":"HLOOKUP(Calculations!E$1,Multipliers!$D$106:$BE$120,B215)","v":1},{"$f":"HLOOKUP(Calculations!$E$1,Multipliers!$D$123:$BE$137,$B215)","v":0.52964448928833008},{"$f":"HLOOKUP(Calculations!$E$1,Multipliers!$D$140:$BE$154,$B215)","v":0.44126397371292114},1.9709084630012512,{"$f":"HLOOKUP(Calculations!$E$1,Multipliers!$D$157:$BE$171,$B215)","v":0.43802809715270996},{"$f":"HLOOKUP(Calculations!$E$1,Multipliers!$D$174:$BE$188,$B215)","v":0.30273362994194031},{"$f":"HLOOKUP(Calculations!$E$1,Multipliers!$D$191:$BE$205,$B215)","v":0.27098053693771362},1.0117422640323639,null,{"$f":"HLOOKUP(Calculations!$E$1,'Household Exp'!$D$3:$BE$17,$B215)","v":0}]
[null,5,"Manufacturing",{"$f":"HLOOKUP(Calculations!$E$1,Multipliers!$D$4:$BE$18,$B216)","v":1.7752462288891619},{"$f":"HLOOKUP(Calculations!$E$1,Multipliers!$D$21:$BE$35,B216)","v":2.1425552439571613},{"$f":"HLOOKUP(Calculations!$E$1,Multipliers!$D$38:$BE$52,$B216)","v":1.7716435052012987},5.6894449780476215,{"$f":"HLOOKUP(Calculations!E$1,Multipliers!$D$55:$BE$69,B216)","v":0.17018918693065643},{"$f":"HLOOKUP(Calculations!$E$1,Multipliers!$D$72:$BE$86,$B216)","v":0.15556126832962036},{"$f":"HLOOKUP(Calculations!$E$1,Multipliers!$D$89:$BE$103,$B216)","v":0.10477171093225479},0.43052216619253159,{"$f":"HLOOKUP(Calculations!E$1,Multipliers!$D$106:$BE$120,B216)","v":1},{"$f":"HLOOKUP(Calculations!$E$1,Multipliers!$D$123:$BE$137,$B216)","v":0.53448808193206787},{"$f":"HLOOKUP(Calculations!$E$1,Multipliers!$D$140:$BE$154,$B216)","v":0.29503726959228516},1.829525351524353,{"$f":"HLOOKUP(Calculations!$E$1,Multipliers!$D$157:$BE$171,$B216)","v":0.31304657459259033},{"$f":"HLOOKUP(Calculations!$E$1,Multipliers!$D$174:$BE$188,$B216)","v":0.28333532810211182},{"$f":"HLOOKUP(Calculations!$E$1,Multipliers!$D$191:$BE$205,$B216)","v":0.18117055296897888},0.77755245566368103,null,{"$f":"HLOOKUP(Calculations!$E$1,'Household Exp'!$D$3:$BE$17,$B216)","v":8.4246952112902174E-2}]
[null,6,"Fabricated Metals",{"$f":"HLOOKUP(Calculations!$E$1,Multipliers!$D$4:$BE$18,$B217)","v":4.1632234207013763},{"$f":"HLOOKUP(Calculations!$E$1,Multipliers!$D$21:$BE$35,B217)","v":2.2314757370367282},{"$f":"HLOOKUP(Calculations!$E$1,Multipliers!$D$38:$BE$52,$B217)","v":2.3662379285911235},8.7609370863292284,{"$f":"HLOOKUP(Calculations!E$1,Multipliers!$D$55:$BE$69,B217)","v":0.26940628886222839},{"$f":"HLOOKUP(Calculations!$E$1,Multipliers!$D$72:$BE$86,$B217)","v":0.15849040448665619},{"$f":"HLOOKUP(Calculations!$E$1,Multipliers!$D$89:$BE$103,$B217)","v":0.13778650760650635},0.56568320095539093,{"$f":"HLOOKUP(Calculations!E$1,Multipliers!$D$106:$BE$120,B217)","v":1},{"$f":"HLOOKUP(Calculations!$E$1,Multipliers!$D$123:$BE$137,$B217)","v":0.54984128475189209},{"$f":"HLOOKUP(Calculations!$E$1,Multipliers!$D$140:$BE$154,$B217)","v":0.38802319765090942},1.9378644824028015,{"$f":"HLOOKUP(Calculations!$E$1,Multipliers!$D$157:$BE$171,$B217)","v":0.33153721690177917},{"$f":"HLOOKUP(Calculations!$E$1,Multipliers!$D$174:$BE$188,$B217)","v":0.27560609579086304},{"$f":"HLOOKUP(Calculations!$E$1,Multipliers!$D$191:$BE$205,$B217)","v":0.23826588690280914},0.84540919959545135,null,{"$f":"HLOOKUP(Calculations!$E$1,'Household Exp'!$D$3:$BE$17,$B217)","v":1.8595744133201937E-6}]
[null,7,"Machinery",{"$f":"HLOOKUP(Calculations!$E$1,Multipliers!$D$4:$BE$18,$B218)","v":2.1136263813823462},{"$f":"HLOOKUP(Calculations!$E$1,Multipliers!$D$21:$BE$35,B218)","v":2.1732648452743888},{"$f":"HLOOKUP(Calculations!$E$1,Multipliers!$D$38:$BE$52,$B218)","v":1.9580052189994603},6.2448964456561953,{"$f":"HLOOKUP(Calculations!E$1,Multipliers!$D$55:$BE$69,B218)","v":0.19695518910884857},{"$f":"HLOOKUP(Calculations!$E$1,Multipliers!$D$72:$BE$86,$B218)","v":0.15607982873916626},{"$f":"HLOOKUP(Calculations!$E$1,Multipliers!$D$89:$BE$103,$B218)","v":0.11371129751205444},0.46674631536006927,{"$f":"HLOOKUP(Calculations!E$1,Multipliers!$D$106:$BE$120,B218)","v":1},{"$f":"HLOOKUP(Calculations!$E$1,Multipliers!$D$123:$BE$137,$B218)","v":0.54007112979888916},{"$f":"HLOOKUP(Calculations!$E$1,Multipliers!$D$140:$BE$154,$B218)","v":0.3202269971370697},1.8602981269359589,{"$f":"HLOOKUP(Calculations!$E$1,Multipliers!$D$157:$BE$171,$B218)","v":0.30251145362854004},{"$f":"HLOOKUP(Calculations!$E$1,Multipliers!$D$174:$BE$188,$B218)","v":0.27557191252708435},{"$f":"HLOOKUP(Calculations!$E$1,Multipliers!$D$191:$BE$205,$B218)","v":0.19663506746292114},0.77471843361854553,null,{"$f":"HLOOKUP(Calculations!$E$1,'Household Exp'!$D$3:$BE$17,$B218)","v":1.2102475191582279E-5}]
[null,8,"Electrical Equipment",{"$f":"HLOOKUP(Calculations!$E$1,Multipliers!$D$4:$BE$18,$B219)","v":1.3193218951584191},{"$f":"HLOOKUP(Calculations!$E$1,Multipliers!$D$21:$BE$35,B219)","v":2.4681934695090018},{"$f":"HLOOKUP(Calculations!$E$1,Multipliers!$D$38:$BE$52,$B219)","v":2.2608492964057514},6.0483646610731725,{"$f":"HLOOKUP(Calculations!E$1,Multipliers!$D$55:$BE$69,B219)","v":0.21880748867988586},{"$f":"HLOOKUP(Calculations!$E$1,Multipliers!$D$72:$BE$86,$B219)","v":0.18668937683105469},{"$f":"HLOOKUP(Calculations!$E$1,Multipliers!$D$89:$BE$103,$B219)","v":0.13064694404602051},0.53614380955696106,{"$f":"HLOOKUP(Calculations!E$1,Multipliers!$D$106:$BE$120,B219)","v":1},{"$f":"HLOOKUP(Calculations!$E$1,Multipliers!$D$123:$BE$137,$B219)","v":0.62066030502319336},{"$f":"HLOOKUP(Calculations!$E$1,Multipliers!$D$140:$BE$154,$B219)","v":0.36792311072349548},1.9885834157466888,{"$f":"HLOOKUP(Calculations!$E$1,Multipliers!$D$157:$BE$171,$B219)","v":0.40665298700332642},{"$f":"HLOOKUP(Calculations!$E$1,Multipliers!$D$174:$BE$188,$B219)","v":0.32177439332008362},{"$f":"HLOOKUP(Calculations!$E$1,Multipliers!$D$191:$BE$205,$B219)","v":0.22592216730117798},0.95434954762458801,null,{"$f":"HLOOKUP(Calculations!$E$1,'Household Exp'!$D$3:$BE$17,$B219)","v":3.2527970911159849E-5}]
[null,9,"TCPU",{"$f":"HLOOKUP(Calculations!$E$1,Multipliers!$D$4:$BE$18,$B220)","v":3.2027370950922087},{"$f":"HLOOKUP(Calculations!$E$1,Multipliers!$D$21:$BE$35,B220)","v":2.3183814552236561},{"$f":"HLOOKUP(Calculations!$E$1,Multipliers!$D$38:$BE$52,$B220)","v":2.3315642655256252},7.8526828158414901,{"$f":"HLOOKUP(Calculations!E$1,Multipliers!$D$55:$BE$69,B220)","v":0.26693859696388245},{"$f":"HLOOKUP(Calculations!$E$1,Multipliers!$D$72:$BE$86,$B220)","v":0.16031894087791443},{"$f":"HLOOKUP(Calculations!$E$1,Multipliers!$D$89:$BE$103,$B220)","v":0.1368924081325531},0.56414994597434998,{"$f":"HLOOKUP(Calculations!E$1,Multipliers!$D$106:$BE$120,B220)","v":1},{"$f":"HLOOKUP(Calculations!$E$1,Multipliers!$D$123:$BE$137,$B220)","v":0.50138568878173828},{"$f":"HLOOKUP(Calculations!$E$1,Multipliers!$D$140:$BE$154,$B220)","v":0.38544002175331116},1.8868257105350494,{"$f":"HLOOKUP(Calculations!$E$1,Multipliers!$D$157:$BE$171,$B220)","v":0.43628072738647461},{"$f":"HLOOKUP(Calculations!$E$1,Multipliers!$D$174:$BE$188,$B220)","v":0.28118002414703369},{"$f":"HLOOKUP(Calculations!$E$1,Multipliers!$D$191:$BE$205,$B220)","v":0.2366940975189209},0.9541548490524292,null,{"$f":"HLOOKUP(Calculations!$E$1,'Household Exp'!$D$3:$BE$17,$B220)","v":2.8760796666206245E-2}]
[null,10,"Wholesale Trade",{"$f":"HLOOKUP(Calculations!$E$1,Multipliers!$D$4:$BE$18,$B221)","v":3.3753966756923472},{"$f":"HLOOKUP(Calculations!$E$1,Multipliers!$D$21:$BE$35,B221)","v":2.0756591268642222},{"$f":"HLOOKUP(Calculations!$E$1,Multipliers!$D$38:$BE$52,$B221)","v":2.3488607138216855},7.7999165163782544,{"$f":"HLOOKUP(Calculations!E$1,Multipliers!$D$55:$BE$69,B221)","v":0.33129799365997314},{"$f":"HLOOKUP(Calculations!$E$1,Multipliers!$D$72:$BE$86,$B221)","v":0.14982107281684875},{"$f":"HLOOKUP(Calculations!$E$1,Multipliers!$D$89:$BE$103,$B221)","v":0.15466809272766113},0.63578715920448303,{"$f":"HLOOKUP(Calculations!E$1,Multipliers!$D$106:$BE$120,B221)","v":1},{"$f":"HLOOKUP(Calculations!$E$1,Multipliers!$D$123:$BE$137,$B221)","v":0.41196525096893311},{"$f":"HLOOKUP(Calculations!$E$1,Multipliers!$D$140:$BE$154,$B221)","v":0.43554052710533142},1.8475057780742645,{"$f":"HLOOKUP(Calculations!$E$1,Multipliers!$D$157:$BE$171,$B221)","v":0.66214662790298462},{"$f":"HLOOKUP(Calculations!$E$1,Multipliers!$D$174:$BE$188,$B221)","v":0.25772756338119507},{"$f":"HLOOKUP(Calculations!$E$1,Multipliers!$D$191:$BE$205,$B221)","v":0.26744905114173889},1.1873232424259186,null,{"$f":"HLOOKUP(Calculations!$E$1,'Household Exp'!$D$3:$BE$17,$B221)","v":4.4468954563178724E-2}]
[null,11,"Retail Trade",{"$f":"HLOOKUP(Calculations!$E$1,Multipliers!$D$4:$BE$18,$B222)","v":10.244031208122585},{"$f":"HLOOKUP(Calculations!$E$1,Multipliers!$D$21:$BE$35,B222)","v":1.916296427974425},{"$f":"HLOOKUP(Calculations!$E$1,Multipliers!$D$38:$BE$52,$B222)","v":2.8755052180482701},15.03583285414528,{"$f":"HLOOKUP(Calculations!E$1,Multipliers!$D$55:$BE$69,B222)","v":0.41805332899093628},{"$f":"HLOOKUP(Calculations!$E$1,Multipliers!$D$72:$BE$86,$B222)","v":0.12177841365337372},{"$f":"HLOOKUP(Calculations!$E$1,Multipliers!$D$89:$BE$103,$B222)","v":0.17313344776630402},0.71296519041061401,{"$f":"HLOOKUP(Calculations!E$1,Multipliers!$D$106:$BE$120,B222)","v":1},{"$f":"HLOOKUP(Calculations!$E$1,Multipliers!$D$123:$BE$137,$B222)","v":0.35289716720581055},{"$f":"HLOOKUP(Calculations!$E$1,Multipliers!$D$140:$BE$154,$B222)","v":0.4875011146068573},1.8403982818126678,{"$f":"HLOOKUP(Calculations!$E$1,Multipliers!$D$157:$BE$171,$B222)","v":0.70588147640228271},{"$f":"HLOOKUP(Calculations!$E$1,Multipliers!$D$174:$BE$188,$B222)","v":0.21953915059566498},{"$f":"HLOOKUP(Calculations!$E$1,Multipliers!$D$191:$BE$205,$B222)","v":0.29936426877975464},1.2247848957777023,null,{"$f":"HLOOKUP(Calculations!$E$1,'Household Exp'!$D$3:$BE$17,$B222)","v":9.5816556801184019E-2}]
[null,12,"FIRE",{"$f":"HLOOKUP(Calculations!$E$1,Multipliers!$D$4:$BE$18,$B223)","v":4.4063292678624038},{"$f":"HLOOKUP(Calculations!$E$1,Multipliers!$D$21:$BE$35,B223)","v":2.1522716907496626},{"$f":"HLOOKUP(Calculations!$E$1,Multipliers!$D$38:$BE$52,$B223)","v":2.0670464974722242},8.6256474560842911,{"$f":"HLOOKUP(Calculations!E$1,Multipliers!$D$55:$BE$69,B223)","v":0.24990385770797729},{"$f":"HLOOKUP(Calculations!$E$1,Multipliers!$D$72:$BE$86,$B223)","v":0.13312092423439026},{"$f":"HLOOKUP(Calculations!$E$1,Multipliers!$D$89:$BE$103,$B223)","v":0.1223742663860321},0.50539904832839966,{"$f":"HLOOKUP(Calculations!E$1,Multipliers!$D$106:$BE$120,B223)","v":1},{"$f":"HLOOKUP(Calculations!$E$1,Multipliers!$D$123:$BE$137,$B223)","v":0.41450536251068115},{"$f":"HLOOKUP(Calculations!$E$1,Multipliers!$D$140:$BE$154,$B223)","v":0.34453186392784119},1.7590372264385223,{"$f":"HLOOKUP(Calculations!$E$1,Multipliers!$D$157:$BE$171,$B223)","v":0.66003161668777466},{"$f":"HLOOKUP(Calculations!$E$1,Multipliers!$D$174:$BE$188,$B223)","v":0.26054501533508301},{"$f":"HLOOKUP(Calculations!$E$1,Multipliers!$D$191:$BE$205,$B223)","v":0.21157951653003693},1.1321561485528946,null,{"$f":"HLOOKUP(Calculations!$E$1,'Household Exp'!$D$3:$BE$17,$B223)","v":0.11956311632902673}]
[null,13,"Misc. Services",{"$f":"HLOOKUP(Calculations!$E$1,Multipliers!$D$4:$BE$18,$B224)","v":5.0334249768802533},{"$f":"HLOOKUP(Calculations!$E$1,Multipliers!$D$21:$BE$35,B224)","v":2.129539620189739},{"$f":"HLOOKUP(Calculations!$E$1,Multipliers!$D$38:$BE$52,$B224)","v":3.5036120439901226},10.666576641060114,{"$f":"HLOOKUP(Calculations!E$1,Multipliers!$D$55:$BE$69,B224)","v":0.54672825336456299},{"$f":"HLOOKUP(Calculations!$E$1,Multipliers!$D$72:$BE$86,$B224)","v":0.16490788757801056},{"$f":"HLOOKUP(Calculations!$E$1,Multipliers!$D$89:$BE$103,$B224)","v":0.22832545638084412},0.93996159732341766,{"$f":"HLOOKUP(Calculations!E$1,Multipliers!$D$106:$BE$120,B224)","v":1},{"$f":"HLOOKUP(Calculations!$E$1,Multipliers!$D$123:$BE$137,$B224)","v":0.42437958717346191},{"$f":"HLOOKUP(Calculations!$E$1,Multipliers!$D$140:$BE$154,$B224)","v":0.64291673898696899},2.0672963261604309,{"$f":"HLOOKUP(Calculations!$E$1,Multipliers!$D$157:$BE$171,$B224)","v":0.65775865316390991},{"$f":"HLOOKUP(Calculations!$E$1,Multipliers!$D$174:$BE$188,$B224)","v":0.2679065465927124},{"$f":"HLOOKUP(Calculations!$E$1,Multipliers!$D$191:$BE$205,$B224)","v":0.39479988813400269},1.320465087890625,null,{"$f":"HLOOKUP(Calculations!$E$1,'Household Exp'!$D$3:$BE$17,$B224)","v":0.60631993203158663}]
[null,14,"Professional Services",{"$f":"HLOOKUP(Calculations!$E$1,Multipliers!$D$4:$BE$18,$B225)","v":6.730931977633321},{"$f":"HLOOKUP(Calculations!$E$1,Multipliers!$D$21:$BE$35,B225)","v":2.2641617732642918},{"$f":"HLOOKUP(Calculations!$E$1,Multipliers!$D$38:$BE$52,$B225)","v":2.891375248080545},11.886468998978158,{"$f":"HLOOKUP(Calculations!E$1,Multipliers!$D$55:$BE$69,B225)","v":0.39246702194213867},{"$f":"HLOOKUP(Calculations!$E$1,Multipliers!$D$72:$BE$86,$B225)","v":0.14683559536933899},{"$f":"HLOOKUP(Calculations!$E$1,Multipliers!$D$89:$BE$103,$B225)","v":0.1730511337518692},0.71235375106334686,{"$f":"HLOOKUP(Calculations!E$1,Multipliers!$D$106:$BE$120,B225)","v":1},{"$f":"HLOOKUP(Calculations!$E$1,Multipliers!$D$123:$BE$137,$B225)","v":0.42177236080169678},{"$f":"HLOOKUP(Calculations!$E$1,Multipliers!$D$140:$BE$154,$B225)","v":0.4872765839099884},1.9090489447116852,{"$f":"HLOOKUP(Calculations!$E$1,Multipliers!$D$157:$BE$171,$B225)","v":0.63465964794158936},{"$f":"HLOOKUP(Calculations!$E$1,Multipliers!$D$174:$BE$188,$B225)","v":0.25660115480422974},{"$f":"HLOOKUP(Calculations!$E$1,Multipliers!$D$191:$BE$205,$B225)","v":0.29922479391098022},1.1904855966567993,null,{"$f":"HLOOKUP(Calculations!$E$1,'Household Exp'!$D$3:$BE$17,$B225)","v":9.9138955994110527E-3}]
[null,15,"Government",{"$f":"HLOOKUP(Calculations!$E$1,Multipliers!$D$4:$BE$18,$B226)","v":6.7706171727197866},{"$f":"HLOOKUP(Calculations!$E$1,Multipliers!$D$21:$BE$35,B226)","v":0.48384951293077194},{"$f":"HLOOKUP(Calculations!$E$1,Multipliers!$D$38:$BE$52,$B226)","v":3.7169836835214292},10.971450369171988,{"$f":"HLOOKUP(Calculations!E$1,Multipliers!$D$55:$BE$69,B226)","v":0.74246829748153687},{"$f":"HLOOKUP(Calculations!$E$1,Multipliers!$D$72:$BE$86,$B226)","v":3.6047250032424927E-2},{"$f":"HLOOKUP(Calculations!$E$1,Multipliers!$D$89:$BE$103,$B226)","v":0.25122275948524475},1.0297383069992065,{"$f":"HLOOKUP(Calculations!E$1,Multipliers!$D$106:$BE$120,B226)","v":1},{"$f":"HLOOKUP(Calculations!$E$1,Multipliers!$D$123:$BE$137,$B226)","v":0.10636031627655029},{"$f":"HLOOKUP(Calculations!$E$1,Multipliers!$D$140:$BE$154,$B226)","v":0.7075238823890686},1.8138841986656189,{"$f":"HLOOKUP(Calculations!$E$1,Multipliers!$D$157:$BE$171,$B226)","v":0.90993893146514893},{"$f":"HLOOKUP(Calculations!$E$1,Multipliers!$D$174:$BE$188,$B226)","v":6.0573060065507889E-2},{"$f":"HLOOKUP(Calculations!$E$1,Multipliers!$D$191:$BE$205,$B226)","v":0.43444430828094482},1.4049562998116016,null,{"$f":"HLOOKUP(Calculations!$E$1,'Household Exp'!$D$3:$BE$17,$B226)","v":6.8764206454442088E-3}]
[]
[]
[null,null,1,"Alabama","Alaska","Arizona","Arkansas","California","Colorado","Connecticut","Delaware","District of Columbia","Florida","Georgia","Hawaii","Idaho","Illinois","Indiana","Iowa","Kansas","Kentucky","Louisiana","Maine","Maryland","Massachusetts","Michigan","Minnesota","Mississippi","Missouri","Montana","MyCounty","MyRegion","Nebraska","Nevada","New Hampshire","New Jersey","New Mexico","New York","North Carolina","North Dakota","Ohio","Oklahoma","Oregon","Pennsylvania","Rhode Island","South Carolina","South Dakota","Tennessee","Texas",null,"Utah","Vermont","Virginia","Washington","West Virginia","Wisconsin","Wyoming"]
[null,null,"Construction (earning per job)",{"$f":"D58*10^6/D7","v":52819.512876761823},84093.577406698125,51306.620204882573,43985.397162058078,59422.093715496594,54177.5570755015,69205.212337392513,55322.822482301744,71774.876137025421,43295.655364761966,47377.507106025863,71403.40234729959,40715.205471724752,62863.63819800684,53745.733792034989,57094.696119490778,52259.793073229208,48456.254499496594,61061.198674767758,41785.972887763528,67423.100462492774,66391.82258099076,51270.760200327568,58010.132484910471,46909.656667700248,52800.755544829335,45677.147609546671,null,null,{"$f":"AG58*10^6/AG7","v":59463.007656921145},59930.149940270952,57996.84318512545,72557.294579371868,46671.7454697426,66875.254105705142,44893.260589422338,69597.913671453687,53454.965859051044,54481.921128765316,55173.951112728602,60880.401077700248,58329.108081465536,45209.317696260776,48020.14686056885,57441.321765462009,65442.915954575561,null,54525.629132249589,46364.810867903027,53031.751960335889,62943.940126725887,57699.668213740755,54098.437553860938,59390.5701479665]
[null,null,null,{"$f":"D230/$I230","v":0.97493345451425362},1.5521847411743916,0.94700874263086454,0.81187487100535571,1.0968027523405373,1,1.2773778677570966,1.0211391112597457,1.3248082787675421,0.79914373592787535,0.87448585103239096,1.3179516796556969,0.75151423706654585,1.1603261865499117,0.992029480346175,1.0538440491128822,0.96460224296197583,0.89439718427998272,1.1270570688462984,0.77127827726766751,1.2444839542789345,1.225448805092255,0.94634684485453935,1.0707410155845145,0.86585034837077002,0.97458723491807753,0.84310090884849775,{"$f":"HLOOKUP('User Add-in Location'!B5,D229:BE231,3)","v":{"$error":"#N/A"}},{"$f":"HLOOKUP('User Add-in Location'!B5,D229:BE231,3)","v":{"$error":"#N/A"}},1.0975579348115285,1.1061803664708003,1.0704957239821911,1.3392500233677291,0.86145902453115686,1.2343719007578768,0.82863205749309399,1.2846262812194074,0.98666253601203435,1.0056178991762152,1.018391269208365,1.1237199379967928,1.076628612105534,0.83446578503451818,0.88634758473233255,1.0602420054749266,1.2079340503185614,null,1.0064246539625812,0.85579367861288613,0.97885092689637476,1.1618083856938697,1.0650105196388029,0.9985396255218687,1.0962208957705528]