{"text_format":"1","workbook":"xlsx","n_sheets":11,"sheets":["About JEDI","FAQ","START","ProjectData","SummaryResults","User Add-in Location","DefaultData","Deflators","Household Exp","Calculations","Multipliers"],"not_rendered":{"charts":0,"images":0,"macros":1,"external_links":0,"defined_names":18,"comments":5,"pivot_tables":0},"unopened":[],"bounds":{"document_bytes":16777216,"sheet_cells":100000,"rows_first":2000,"rows_last":500,"rows_between":2000,"halvings":0,"cell_chars":16384,"cell_head_chars":4096},"cells_cut":0,"cells_raw":0,"read":"whole","date_system":"1900"}

{"sheet":"About JEDI","index":0,"n_rows":44,"n_cols":2,"rows_kept":44,"cut":false,"hidden":false,"merged":[]}
[]
[]
[null,"JEDI - WIND"]
[]
[null,"Jobs and Economic Development Impact (JEDI) Model"]
[]
[]
[]
{"$rows_left_out":37}
{"sheet":"FAQ","index":1,"n_rows":94,"n_cols":2,"rows_kept":94,"cut":false,"hidden":false,"merged":[]}
[]
[null,"JEDI - WIND"]
[]
[null,"Jobs and Economic Development Impact (JEDI) Model "]
[]
[null,"Frequently Asked Questions (FAQ)"]
[]
[]
{"$rows_left_out":87}
{"sheet":"START","index":2,"n_rows":4,"n_cols":1,"rows_kept":4,"cut":false,"hidden":false,"merged":[]}
[]
[]
["JEDI - WIND"]
["Jobs and Economic Development Impact Model"]

{"sheet":"ProjectData","index":3,"n_rows":738,"n_cols":35,"rows_kept":738,"cut":false,"hidden":false,"merged":[[26,0,26,4],[23,0,25,0]]}
["Wind Farm Project Data"]
[]
["INSTRUCTIONS:      Begin by entering Project Location (from pull-down list) and other Descriptive Data.  "]
["                               After inserting required data press enter (or cursor to the next cell) to continue."]
["                               Once Descriptive Data is complete, choose \"Y\" or \"N\" on Line 24 to continue."]
["                                    Choose \"Y\" to accept Project Cost and Local Share defaults or \"N\" to review/modify values."]
["                                    To utilize new values in analysis you must choose an \"N\" in \"Utilize Model Default Values (below)?\" - Line 24"]
["                               Additional information is available by pointing to the red triangles located in cell corners and in the FAQ tab."]
{"$rows_left_out":731}
{"sheet":"SummaryResults","index":4,"n_rows":143,"n_cols":58,"rows_kept":143,"cut":false,"hidden":false,"merged":[]}
[{"$f":"CONCATENATE(\"Wind Farm - Project Data Summary based on \",$AE$41, \" values\")","v":"Wind Farm - Project Data Summary based on User modifications to default values"},null,null,null,null,null,null,null,null,null,null,null,null,null,null,null,null,null,null,null,null,null,null,null,null,null,null,null,null,null,null,null,null,null,null,null,null,null,null,null,null,null,null,null,null,null,null,null,null,null,null,null,null,{"$f":"Summary_Results","v":"Wind Farm - Project Data Summary based on User modifications to default values"}]
["Project Location",null,{"$f":"IF(ProjectData!B13=\"MyCounty\",'User Add-in Location'!B3,IF(ProjectData!B13=\"MyRegion\",'User Add-in Location'!B4,ProjectData!B13))","v":"CONNECTICUT"},{"$f":"ProjectData!D14","v":""},null,null,null,null,null,null,null,null,null,null,null,null,null,null,null,null,null,null,null,null,null,null,null,null,null,null,null,null,null,null,null,null,null,null,null,null,null,null,null,null,null,null,null,null,null,null,null,null,null,"Project Location",null,{"$f":"C2","v":"CONNECTICUT"},{"$f":"D2","v":""}]
["Year of Construction ",null,{"$f":"+ProjectData!B15","v":2017},null,null,null,null,null,null,null,null,null,null,null,null,null,null,null,null,null,null,null,null,null,null,null,null,null,null,null,null,null,null,null,null,null,null,null,null,null,null,null,null,null,null,null,null,null,null,null,null,null,null,"Year of Construction ",null,{"$f":"C3","v":2017}]
["Total Project Size - Nameplate Capacity (MW)",null,{"$f":"+ProjectData!B16","v":300},null,null,null,null,null,null,null,null,null,null,null,null,null,null,null,null,null,null,null,null,null,null,null,null,null,null,null,null,null,null,null,null,null,null,null,null,null,null,null,null,null,null,null,null,null,null,null,null,null,null,"Total Project Size - Nameplate Capacity (MW)",null,{"$f":"C4","v":300}]
["Number of Projects (included in total)",null,{"$f":"+ProjectData!B17","v":1},null,null,null,null,null,null,null,null,null,null,null,null,null,null,null,null,null,null,null,null,null,null,null,null,null,null,null,null,null,null,null,null,null,null,null,null,null,null,null,null,null,null,null,null,null,null,null,null,null,null,"Number of Projects (included in total)",null,1]
["Turbine Size (kW)",null,{"$f":"+ProjectData!B18","v":2300},null,null,null,null,null,null,null,null,null,null,null,null,null,null,null,null,null,null,null,null,null,null,null,null,null,null,null,null,null,null,null,null,null,null,null,null,null,null,null,null,null,null,null,null,null,null,null,null,null,null,"Turbine Size (kW)",null,2300]
["Number of Turbines",null,{"$f":"+ProjectData!B19","v":131},null,null,null,null,null,null,null,null,null,null,null,null,null,null,null,null,null,null,null,null,null,null,null,null,null,null,null,null,null,null,null,null,null,null,null,null,null,null,null,null,null,null,null,null,null,null,null,null,null,null,"Number of Turbines",null,131]
["Installed Project Cost ($/kW)",null,{"$f":"Calculations!D37/(C4*1000)","v":1528.9174490108994},{"$f":"AB8","v":1453},"without taxes",null,null,null,null,null,null,null,null,null,null,null,null,null,null,null,null,null,null,null,null,"     Installed Project Cost ($/kW without taxes)",null,{"$f":"ROUND(ProjectData!C62,0)","v":1453},null,null,null,null,null,null,null,null,null,null,null,null,null,null,null,null,null,null,null,null,null,null,null,null,null,"Installed Project Cost ($/kW)",null,1528.9174490108994,{"$f":"D8","v":1453},{"$f":"E8","v":"without taxes"}]
{"$rows_left_out":136}
{"sheet":"User Add-in Location","index":5,"n_rows":732,"n_cols":15,"rows_kept":732,"cut":false,"hidden":false,"merged":[]}
[" Multipliers For Economic Input-Output Analysis"]
[]
["MyCounty (name)",null,"Year of Data",null,{"$f":"IF(B3=\"\",\"\",IF(D3=\"\",\"Enter Year of Data\",IF(D3>2006,IF(D3<2021,\"\",\"ERROR - Deflators Data Not Current\"),\"ERROR - Deflators Data Not Current\")))","v":""}]
["MyRegion (includes)",null,"Year of Data",null,{"$f":"IF(B4=\"\",\"\",IF(D4=\"\",\"Enter Year of Data\",IF(D4>2006,IF(D4<2021,\"\",\"ERROR - Deflators Data Not Current\"),\"ERROR - Deflators Data Not Current\")))","v":""}]
["State (Name)",""]
[]
["Jobs Per Million Dollars Change in Final Demand",null,null,"Personal Consumption Expenditures (PCE)"]
["  Jobs Direct Multipliers","MyCounty","MyRegion",null,{"$f":"B8","v":"MyCounty"},{"$f":"C8","v":"MyRegion"}]
{"$rows_left_out":725}
{"sheet":"DefaultData","index":6,"n_rows":160,"n_cols":58,"rows_kept":160,"cut":false,"hidden":false,"merged":[]}
[null,null,null,null,null,null,null,null,null,null,null,null,null,null,null,null,null,null,"Ann Avg Increase"]
[null,null,null,null,null,null,null,null,null,null,"Default",null,null,null,null,null,null,null,0,null,"2005-2008",0.17456747180786419]
[null,null,null,null,null,null,null,"Const Jobs/",{"$f":"E5","v":300},"0&M Jobs/",{"$f":"E5","v":300},null,null,null,"Average installed project cost per kW",null,null,{"$f":"IF(ProjectData!_xlnm.Print_Area<2000,O5,HLOOKUP(ProjectData!_xlnm.Print_Area,O4:AS5,N5))","v":1940}]
[null,null,null,"Number of Turbines","MW","Total Installed Cost",null,"Foundation",{"$f":"I$3*AM30","v":52.558547049125131},"Field Tech",{"$f":"K$3*AP56","v":10.799999999999999},null,null,null,2000,2001,2002,2003,2004,2005,2006,2007,2008,2009,2010,2011,2012,2013,2014,2015,2016,2017,2018,2019,2020,2021,2022,2023,2024,2025,{"$f":"AN4+1","v":2026},2027,2028,2029,2030]
["Warning",null,null,{"$f":"ROUNDUP(ProjectData!B16*1000/ProjectData!B18,0)","v":131},{"$f":"ProjectData!B16","v":300},1453,null,"Erection",{"$f":"I$3*AM31","v":52.558547049125131},"Admin",{"$f":"K$3*AP57","v":1.5999999999999999},null,null,2,1284.3037204522097,1031.2445956368742,1225.1043412685979,1134.7082720604471,1075.4007471364907,1235.6878182978105,1495.5576742673609,1689.0285489154605,2042.9707112898295,{"$f":"W5*(1+$S2)","v":2042.9707112898295},2042.9707112898295,2042.9707112898295,1940,1940,1940,1940,1940,1940,1940,1940,1940,1940,1940,1940,1940,1940,1940,1940,1940,1940,1940]
[null,null,null,null,null,null,null,"Electrical",{"$f":"I$3*AM32","v":57.814401754037654},"Management",{"$f":"K$3*AP58","v":1.2}]
["This Worksheet contains Data and Formulas that are an integral part of the JEDI model.  ",null,null,"Construction",null," User",null,"Management/supervision",{"$f":"I$3*AM33","v":22.068504147712069},"Total",{"$f":"SUM(K4:K6)","v":13.599999999999998},null,null,null,null,"Construction Loc. Adj.",null,{"$f":"HLOOKUP(ProjectData!B13,Multipliers!D229:BE231,3)","v":1.2105070804166769},null,null,null,null,null,null,null,null,null,null,null,null,null,null,null,null,null,null,null,null,null,"O&M Cost"]
[null,null,null,"Cost Per KW","Project Cost","Selected Cost Per KW","Default Cost Per KW","MW Per Turbine",{"$f":"SUM(I4:I7)","v":185},null,null,null,null,null,null,"Adj. Installed Cost (per KW)",null,{"$f":"Y46","v":1993.4259606802664},null,null,null,null,null,null,null,null,null,null,null,null,null,null,null,null,"Avg. Turbine Size (KW)",null,null,{"$f":"IF(ProjectData!_xlnm.Print_Area<=2003,AK9,AK10)","v":1500},null,"<=20 MW",{"$f":"25+Z119","v":25.690080351531993},"per KW"]
{"$rows_left_out":153}
{"sheet":"Deflators","index":7,"n_rows":55,"n_cols":39,"rows_kept":55,"cut":false,"hidden":false,"merged":[]}
[]
[null,null,{"$f":"CONCATENATE(\"Conversion to Year \",E4,\" dollars and back for consistency with multiplier data.\")","v":"Conversion to Year 2016 dollars and back for consistency with multiplier data."}]
[]
[null,null,"  Year of Multiplier Data",null,{"$f":"IF(ProjectData!B13=\"MYCOUNTY\",'User Add-in Location'!D3,IF(ProjectData!B13=\"MYREGION\",'User Add-in Location'!D4,Multipliers!D2))","v":2016},{"$f":"IF(E4=0,\"ERROR\",\"\")","v":""},"Region of Analysis",null,{"$f":"ProjectData!B13","v":"CONNECTICUT"}]
["Warning",null,"  Year of Construction $s",null,{"$f":"ProjectData!B22","v":2017}]
[]
["This Worksheet contains Data and Formulas that are an integral part of the JEDI model.  ",null,null,"Deflator",null,{"$f":"HLOOKUP($E$5,$D$11:$AM$43,$D$53)","v":0.98309999999999997}]
[null,null,null,"Inflator",null,{"$f":"HLOOKUP($E$5,$D$11:$AM$43,$D$54)","v":1.0172000000000001}]
{"$rows_left_out":48}
{"sheet":"Household Exp","index":8,"n_rows":20,"n_cols":56,"rows_kept":20,"cut":false,"hidden":true,"merged":[]}
[null,"Personal Consumption Expenditures "]
[null,"Year of Data",2016]
[null,null,"Alabama","Alaska","Arizona","Arkansas","California","Colorado","Connecticut","Delaware","District of Columbia","Florida","Georgia","Hawaii","Idaho","Illinois","Indiana","Iowa","Kansas","Kentucky","Louisiana","Maine","Maryland","Massachusetts","Michigan","Minnesota","Mississippi","Missouri","Montana","MyCounty","MyRegion","Nebraska","Nevada","New Hampshire","New Jersey","New Mexico","New York","North Carolina","North Dakota","Ohio","Oklahoma","Oregon","Pennsylvania","Rhode Island","South Carolina","South Dakota","Tennessee","Texas","United States","Utah","Vermont","Virginia","Washington","West Virginia","Wisconsin","Wyoming"]
[null,"Agriculture",4.0163734189709354E-3,6.1450710048088081E-3,4.2016933423446052E-3,7.9722858902692064E-3,3.9376244137061707E-3,6.2705551244774376E-3,7.9060104758105318E-4,5.3248684568050235E-3,6.3940342243682204E-4,3.3844040301768399E-3,4.2126524249515894E-3,4.7936874538077661E-3,9.3316715545898703E-3,3.1455303049938428E-3,2.7131907355874454E-3,8.6965223944363186E-3,7.6102369633671363E-3,2.7388096256016534E-3,2.105195278456162E-3,3.8381719040847676E-3,2.0576270551737378E-3,8.70183433219999E-4,2.3220594700286284E-3,5.2797189115222527E-3,6.3466626421076503E-3,3.4641081784864071E-3,6.9568868643487859E-3,{"$f":"'User Add-in Location'!E9","v":0},{"$f":"'User Add-in Location'!F9","v":0},8.5865473096531485E-3,1.5873202959742632E-3,1.3343321626759714E-3,7.7399519813149459E-4,5.7853256634056585E-3,2.4311083958786788E-3,4.2545106661419762E-3,5.5272319963868034E-3,2.1234231289931939E-3,4.2276124882320706E-3,6.0428577695873674E-3,2.6110825176626907E-3,5.9654076556800439E-4,2.311563558039376E-3,8.7671872538220615E-3,1.7655881715864347E-3,3.1835418381665603E-3,5.2579171427173891E-3,2.6368069749400647E-3,7.3865350782525239E-3,3.2739504412473528E-3,4.175643536391261E-3,2.7545474871674591E-3,6.4502275361509155E-3,4.0858866677679351E-3]
["Warning","Mining",4.5342653891817915E-6,2.7510167459744092E-5,6.5467867889972793E-6,7.0898839911708192E-6,5.8028303258059065E-6,1.3723398224191555E-5,1.7716183777684384E-6,5.0915956829974676E-7,1.7141331397792614E-7,4.5208900129859971E-6,2.1732723549290811E-6,2.3420271832846503E-6,6.0922457517539545E-6,2.5857386666895203E-6,2.6124132290274102E-6,1.9635260457325694E-6,1.1961462539214664E-5,3.4826861632377029E-6,2.1835955255984943E-5,2.2246983698889801E-6,2.7515909278118606E-6,2.3906888347798109E-6,3.062461283867796E-6,2.355135122467692E-6,8.6799927279817615E-6,1.8221139718061016E-6,1.6856291374944015E-5,{"$f":"'User Add-in Location'!E10","v":0},{"$f":"'User Add-in Location'!F10","v":0},2.5830512167125956E-6,1.0616785194144434E-5,2.4742958252124233E-6,1.6626249441631725E-6,2.6323748733197165E-5,2.0302075258254956E-6,1.997451731036695E-6,2.5521356765750313E-5,6.2580522594263989E-6,2.4842526714837907E-5,3.010857928775452E-6,9.3047972240921491E-6,1.6091502682610221E-6,2.0708606154706478E-6,4.6354322580113202E-6,2.2207748239519645E-6,2.5416215394372215E-5,1.3797605679179708E-5,9.7403346533042254E-6,3.3296004607241033E-6,3.2822058752388924E-6,2.6368624017005881E-6,1.7651551393964732E-5,1.7604607093719548E-6,2.7879191215270023E-5]
[null,"Construction",0,0,0,0,0,0,0,0,0,0,0,0,0,0,0,0,0,0,0,0,0,0,0,0,0,0,0,{"$f":"'User Add-in Location'!E11","v":0},{"$f":"'User Add-in Location'!F11","v":0},0,0,0,0,0,0,0,0,0,0,0,0,0,0,0,0,0,0,0,0,0,0,0,0,0]
["This Worksheet contains Data and Formulas that are an integral part of the JEDI model.  ","Manufacturing",4.3549188600281084E-2,3.7638076314555416E-2,2.6680811794270808E-2,4.0204851359514557E-2,8.0031585291581303E-2,4.3033820025522022E-2,2.7263567085567413E-2,2.2616913624493331E-2,1.9726315157632245E-3,3.6838074428192674E-2,4.1672810114572946E-2,4.0662458568669707E-2,3.4415104480813107E-2,4.8758651028074557E-2,5.2723952521407082E-2,3.6523868644295389E-2,3.9308696645719503E-2,3.8981974728971254E-2,4.5851139995651255E-2,2.7707137567970098E-2,2.0061923727773698E-2,3.5348121613254867E-2,5.686702529779683E-2,5.6058910767150201E-2,3.8025921152812281E-2,3.3134774613235267E-2,3.2494060241948959E-2,{"$f":"'User Add-in Location'!E12","v":0},{"$f":"'User Add-in Location'!F12","v":0},2.9410775683349346E-2,1.0771538068252574E-2,1.9179037992478221E-2,3.4840264321519814E-2,2.7023830096035033E-2,3.1541040148395462E-2,5.1483900159230468E-2,2.8270754642427433E-2,5.7011051303448496E-2,3.8705037154153833E-2,3.8251033011470759E-2,4.9445285053248952E-2,1.4352349790605535E-2,3.4918937990878404E-2,2.1256911914501419E-2,4.0385459366363917E-2,7.8462561434229611E-2,0.14219683876407418,5.1973918014772164E-2,2.3390696911082857E-2,3.0288312176406221E-2,5.8379100028568866E-2,2.0758269291626365E-2,4.9464641082514409E-2,2.8372109086011881E-2]
[null,"Fabricated Metals",1.8612813822562479E-6,5.4798225119512439E-7,1.5326823454098225E-6,1.120239274977676E-6,3.0413391521616958E-6,1.8511521017709522E-6,1.0686066388241698E-6,2.5940310572665966E-7,4.0059829194136123E-10,1.7169990869832072E-6,1.2736339081004451E-6,3.7077666379409461E-7,8.9706821487456803E-7,1.6675692453555817E-6,1.7619877286724685E-6,1.0184399721840018E-6,1.1022802494793246E-6,8.4812530512023556E-7,1.7719989980955736E-6,6.1561915286895193E-7,4.3485012181399E-7,1.2378168281174257E-6,2.1603665813389499E-6,2.4564548957409413E-6,7.0290702718534992E-7,8.4817166653848162E-7,5.7999223364916038E-7,{"$f":"'User Add-in Location'!E13","v":0},{"$f":"'User Add-in Location'!F13","v":0},1.0863635352485888E-6,4.3518540063853744E-7,1.1166122860023634E-6,9.1627895511334181E-7,4.9556822693818513E-7,1.2052732959463384E-6,1.8579860192970782E-6,3.819541080808129E-7,1.9136253802930234E-6,2.0482681665330369E-6,2.145977045349595E-6,2.1572418574773822E-6,2.3591309532282991E-7,1.9451721509829822E-6,4.8627051273289873E-7,1.2577281953450428E-6,3.7731809811415037E-6,5.4894648899781974E-6,3.0887527855084812E-6,2.817653702188703E-7,1.5679025628611886E-6,2.4087527786361367E-6,2.8607767350623396E-7,2.0716572259070348E-6,1.0865804558327287E-7]
{"$rows_left_out":13}
{"sheet":"Calculations","index":9,"n_rows":233,"n_cols":37,"rows_kept":233,"cut":false,"hidden":false,"merged":[]}
[null,null,"Economic Impact Analysis for ",null,{"$f":"ProjectData!B13","v":"CONNECTICUT"},"Wind Power Plant"]
[]
[null,null,"Project Construction Costs "]
[null,null,null,"Cost","Purchased Local",null,"Local $ Spending",null,null,null,null,null,null,null,null,null,null,null,null,null,null,null,null,null,null,null,null,"Construction Costs ","Cost","Local Share"]
[null,null,"Balance of Plant",null,null,null,null,null,null,null,null,null,null,null,null,null,null,null,null,null,null,null,null,null,null,null,null,"Balance of Plant"]
["Warning",null,"  Materials",null,null,null,null,null,null,null,null,null,null,null,null,null,null,null,null,null,null,null,null,null,null,null,null,"  Materials"]
[null,null,"    Construction (concrete rebar, equip, roads and site prep)",{"$f":"IF(ProjectData!$B$24=\"y\",DefaultData!D18,ProjectData!B40)","v":46814767.338654183},{"$f":"IF(ProjectData!$B$24=\"y\",IF(ProjectData!T$12=0,DefaultData!G18,ProjectData!T40),ProjectData!E40)","v":0.9},null,{"$f":"+E7*D7","v":42133290.604788765},null,null,null,null,null,null,null,null,null,null,null,null,null,null,null,null,null,null,null,null,"    Construction (concrete rebar, equip, roads and site prep)",{"$f":"D7","v":46814767.338654183},{"$f":"E7","v":0.9}]
["This Worksheet contains Data and Formulas that are an integral part of the JEDI model.  ",null,"    Transformer",{"$f":"IF(ProjectData!$B$24=\"y\",DefaultData!D19,ProjectData!B41)","v":5295720.7343680495},{"$f":"IF(ProjectData!$B$24=\"y\",IF(ProjectData!T$12=0,DefaultData!G19,ProjectData!T41),ProjectData!E41)","v":0},null,{"$f":"+E8*D8","v":0},null,null,null,null,null,null,null,null,null,null,null,null,null,null,null,null,null,null,null,null,"    Transformer",{"$f":"D8","v":5295720.7343680495},0]
{"$rows_left_out":226}
{"sheet":"Multipliers","index":10,"n_rows":231,"n_cols":57,"rows_kept":231,"cut":false,"hidden":true,"merged":[[206,2,206,7]]}
[null,null," Multipliers For Economic Input-Output Analysis"]
[null,null,"Year of Data",2016]
[null,null,"Jobs Per Million Dollars Change in Final Demand"]
[null,null,"  Jobs Direct Multipliers","Alabama","Alaska","Arizona","Arkansas","California","Colorado","Connecticut","Delaware","District of Columbia","Florida","Georgia","Hawaii","Idaho","Illinois","Indiana","Iowa","Kansas","Kentucky","Louisiana","Maine","Maryland","Massachusetts","Michigan","Minnesota","Mississippi","Missouri","Montana","MyCounty","MyRegion","Nebraska","Nevada","New Hampshire","New Jersey","New Mexico","New York","North Carolina","North Dakota","Ohio","Oklahoma","Oregon","Pennsylvania","Rhode Island","South Carolina","South Dakota","Tennessee","Texas","United States","Utah","Vermont","Virginia","Washington","West Virginia","Wisconsin","Wyoming"]
["Warning",null,"Agriculture",7.9949730757133013,7.7907795388243066,8.3666135506743693,5.8785261662521311,7.8338075914296876,7.299426501510923,16.155394278658015,3.2616557710062151,29.687981303432725,11.657748549702257,5.9428005565391011,19.577764283447074,5.514553519712396,4.4181213700955793,5.3947568407807625,3.3194986868826275,4.0730665399794326,14.33309549686358,10.389127874191589,15.894848807066804,8.3067283638214562,16.296684943263799,9.1123151082387412,4.4997728263752999,7.2509355095439343,9.266682290494245,7.8428979224180519,{"$f":"'User Add-in Location'!B9","v":0},{"$f":"'User Add-in Location'!C9","v":0},2.7181765364851898,8.375778007211963,18.730016390725602,14.347672151842252,10.043590749909402,10.805883825133408,6.184010742284455,3.465485754828499,9.0904174692953639,10.759819805126432,11.206333957584748,10.342380621002571,17.012565283448428,10.781270070750228,3.3175538460914997,17.396239695636961,11.635833736974579,7.4541603769485354,10.90752580185254,12.142298271250649,13.019286342124861,8.9770509415904822,22.77024001279565,7.1785614608315154,10.269513292162348]
[null,null,"Mining",2.7034654998962,1.8182255351283965,2.8858044900045177,5.1721784602240062,3.9648412207320289,3.5863594243095163,5.7529650683290994,16.412898400742137,22.898269272490563,5.8368538223737332,4.2960403026380352,5.9669135339145809,3.0740837138348289,5.3881862922734065,3.4167903766094248,5.9651444250916814,8.114387089601717,3.0807517142072558,4.3677231619154506,6.9292546512322222,3.847960686375786,3.6342376895843773,4.844865001747662,2.9806416105917468,5.8912111095240496,4.5859953341884161,3.1042798847320836,{"$f":"'User Add-in Location'!B10","v":0},{"$f":"'User Add-in Location'!C10","v":0},6.5847815318814416,2.9327334559068632,6.4981655231156736,5.1207251039420356,2.9933642165386223,6.4274926335049134,5.5017035996743262,3.2888251027265154,3.8736025809054926,4.6161494060679198,6.2356146103676986,2.7216914615489132,5.4168447366879215,5.4558032752483241,6.5400694162977029,4.774514612291954,2.9251985592103491,3.4411151708671839,3.2100550031904924,2.9827794450924174,3.530680450301094,4.6958671882423815,2.6110394883810626,3.5874288075386653,2.3955352449529541]
["This Worksheet contains Data and Formulas that are an integral part of the JEDI model.  ",null,"Construction",6.8544079394225434,5.8017156755688468,6.4458482820279812,6.8812534054193568,5.5804522649771524,6.0107670588372395,5.8961550253352453,5.8384931995596068,5.7011684650362557,6.4326645065275851,6.2086800260684569,5.2145056678326034,6.4894238019681252,5.6812337986481873,6.4681239825547614,6.3600172062214364,6.4762565831649894,6.423427746221706,6.5720580224780996,7.2193643649654078,6.0557974573633198,5.8114648514058569,6.0069518053495559,6.0098762929760339,6.8274457548101397,6.7944370562682028,6.5328818196569269,{"$f":"'User Add-in Location'!B11","v":0},{"$f":"'User Add-in Location'!C11","v":0},6.9698405663382932,6.2746400500752175,6.8625500685417569,5.3508010528637255,6.8954699048788077,5.5608912286765859,6.6299724629880608,5.6310415231093778,6.2908309142616847,6.5297611364976822,6.2641703813201328,5.8671773197848172,5.8892135315235459,6.1787184953424337,6.7197508753266044,6.5219877075511787,5.8568627774069748,6.0523157730888588,6.0508308095159204,7.4261455865344681,6.1210665702265095,5.7007459424243416,5.729768532377336,6.1517854524234883,6.0164540151852188]
[null,null,"Manufacturing",1.8272209063252574,2.2920589895565362,2.4203599167135827,2.1891788050199552,1.8117630394354594,2.2030461960473509,2.1968733750812981,1.8553934666275931,2.7217454152380882,2.4572430944563108,2.0446716597081394,2.1975485427836698,2.1165069328039419,1.8395120892547407,1.7232789658125187,1.7656697388073734,1.6186585961627875,1.5595225734176441,0.88135836115406774,2.6071288412684979,2.180903230802429,2.1209013625269599,1.8341334687209445,2.1436951771506534,1.9752734946423673,1.7268223383012642,1.5470652194204828,{"$f":"'User Add-in Location'!B12","v":0},{"$f":"'User Add-in Location'!C12","v":0},1.7020567287369159,2.7936062349585309,2.6961074858454062,1.8464892688412049,2.010034269651511,2.2360959424554006,1.8695770133368792,1.7372030983400422,1.8763962524092859,1.9488683795289707,2.5494908785113255,2.0722061479979765,2.6513503279635939,1.9050235142503031,2.1571814050141742,1.8442598567811401,1.270074679650917,1.8495987219202039,2.1173836636012573,2.4878708830991574,2.0695042698438071,1.6327175836078029,1.5879880652437512,2.311751532670915,1.0077766396271366]
{"$rows_left_out":223}